All pastes #434915 Raw Edit

Someone

public text v1 · immutable
·published 2007-04-11 17:58 UTC
rendered paste body
        then mv -f ".deps/libgstrtppayloads_la-gstrtpg729pay.Tpo" ".deps/libgstrtppayloads_la-gstrtpg729pay.Plo"; else rm -f ".deps/libgstrtppayloads_la-gstrtpg729pay.Tpo"; exit 1; fi
 gcc -std=gnu99 -DHAVE_CONFIG_H -I. -I. -I../.. -pthread -I/usr/include/libxml2 -I/opt/gnome/include/gstreamer-0.10 -I/opt/gnome/include/glib-2.0 -I/opt/gnome/lib/glib-2.0/include -pthread -I/usr/include/libxml2 -I/opt/gnome/include/gstreamer-0.10 -I/opt/gnome/include/glib-2.0 -I/opt/gnome/lib/glib-2.0/include -Wall -DEXTERN_BUF -DRTP_SUPPORT -O2 -g -m32 -march=i586 -mtune=i686 -fmessage-length=0 -D_FORTIFY_SOURCE=2 -MT libgstrtppayloads_la-gstrtpg729pay.lo -MD -MP -MF .deps/libgstrtppayloads_la-gstrtpg729pay.Tpo -c gstrtpg729pay.c  -fPIC -DPIC -o .libs/libgstrtppayloads_la-gstrtpg729pay.o
In file included from gstrtpg729pay.c:36:
gstrtpg729pay.h:25:44: error: gst/rtp/gstbasertpaudiopayload.h: No such file or directory
In file included from gstrtpg729pay.c:36:
gstrtpg729pay.h:45: error: expected specifier-qualifier-list before 'GstBaseRTPAudioPayload'
gstrtpg729pay.h:52: error: expected specifier-qualifier-list before 'GstBaseRTPAudioPayloadClass'
gstrtpg729pay.c:50: error: expected ')' before '*' token
gstrtpg729pay.c:52: error: expected ')' before '*' token
gstrtpg729pay.c:89: error: expected '=', ',', ';', 'asm' or '__attribute__' before '*' token
gstrtpg729pay.c: In function 'gst_rtp_g729_pay_class_init_trampoline':
gstrtpg729pay.c:89: error: 'parent_class' undeclared (first use in this function)
gstrtpg729pay.c:89: error: (Each undeclared identifier is reported only once
gstrtpg729pay.c:89: error: for each function it appears in.)
gstrtpg729pay.c:89: error: 'GstBaseRTPAudioPayloadClass' undeclared (first use in this function)
gstrtpg729pay.c:89: error: expected expression before ')' token
gstrtpg729pay.c: In function 'gst_rtp_g729_pay_get_type':
gstrtpg729pay.c:89: error: 'GST_TYPE_BASE_RTP_AUDIO_PAYLOAD' undeclared (first use in this function)
gstrtpg729pay.c: In function 'gst_rtp_g729_pay_class_init':
gstrtpg729pay.c:107: error: 'GstBaseRTPPayloadClass' undeclared (first use in this function)
gstrtpg729pay.c:107: error: 'payload_class' undeclared (first use in this function)
gstrtpg729pay.c:107: warning: implicit declaration of function 'GST_BASE_RTP_PAYLOAD_CLASS'
gstrtpg729pay.c:109: error: 'gst_rtp_g729_pay_set_caps' undeclared (first use in this function)
gstrtpg729pay.c:110: error: 'gst_rtp_g729_pay_handle_buffer' undeclared (first use in this function)
gstrtpg729pay.c: In function 'gst_rtp_g729_pay_init':
gstrtpg729pay.c:116: error: 'GstBaseRTPPayload' undeclared (first use in this function)
gstrtpg729pay.c:116: error: 'payload' undeclared (first use in this function)
gstrtpg729pay.c:116: warning: implicit declaration of function 'GST_BASE_RTP_PAYLOAD'
gstrtpg729pay.c:117: error: 'GstBaseRTPAudioPayload' undeclared (first use in this function)
gstrtpg729pay.c:117: error: 'audiopayload' undeclared (first use in this function)
gstrtpg729pay.c:117: warning: implicit declaration of function 'GST_BASE_RTP_AUDIO_PAYLOAD'
gstrtpg729pay.c:120: warning: implicit declaration of function 'gst_basertppayload_set_options'
gstrtpg729pay.c:123: warning: implicit declaration of function 'gst_base_rtp_audio_payload_set_frame_based'
gstrtpg729pay.c:124: warning: implicit declaration of function 'gst_base_rtp_audio_payload_set_frame_options'
gstrtpg729pay.c: At top level:
gstrtpg729pay.c:130: error: expected ')' before '*' token
gstrtpg729pay.c:148: error: expected ')' before '*' token
make[3]: *** [libgstrtppayloads_la-gstrtpg729pay.lo] Error 1
make[3]: Leaving directory `/usr/src/packages/BUILD/gst-plugins-farsight-0.10.2/gst/rtppayloads'
make[2]: *** [all-recursive] Error 1
make[2]: Leaving directory `/usr/src/packages/BUILD/gst-plugins-farsight-0.10.2/gst'
make[1]: *** [all-recursive] Error 1
make[1]: Leaving directory `/usr/src/packages/BUILD/gst-plugins-farsight-0.10.2'
make: *** [all] Error 2
error: Bad exit status from /var/tmp/rpm-tmp.17813 (%build)