All pastes #434190 Raw Edit

Mine

public text v1 · immutable
·published 2007-04-11 08:45 UTC
rendered paste body
circle asterisk-1.4.2 # cat config.log
This file contains any messages produced by compilers while
running configure, to aid debugging if configure makes a mistake.

It was created by configure, which was
generated by GNU Autoconf 2.60.  Invocation command line was

  $ ./configure --prefix=/!/asterisk --oldincludedir=/!/asterisk-include-dir --datadir=/!/asterisk-data --htmldir=/!/asterisk-docs --with-asound --with-curl=/usr/lib/ --with-curses=/usr --with-ncurses=/usr --with-netsnmp=/usr --with-newt=/usr --with-ogg=/usr --with-popt=/usr --with-postgres=/usr --with-pwlib=/usr --with-h323=/usr --with-speex=/usr --with-sqlite=/usr --with-odbc=/usr --with-ssl=/usr --with-tds=/usr --with-termcap=/usr --with-tinfo=/usr --with-vorbis=/usr --with-z=/usr --with-kde --with-qt=/usr/include/qt4

## --------- ##
## Platform. ##
## --------- ##

hostname = circle
uname -m = i686
uname -r = 2.6.19-gentoo-r5
uname -s = Linux
uname -v = #12 SMP PREEMPT Thu Mar 29 20:32:18 CDT 2007

/usr/bin/uname -p = unknown
/bin/uname -X     = unknown

/bin/arch              = i686
/usr/bin/arch -k       = unknown
/usr/convex/getsysinfo = unknown
/usr/bin/hostinfo      = unknown
/bin/machine           = unknown
/usr/bin/oslevel       = unknown
/bin/universe          = unknown

PATH: /usr/local/sbin
PATH: /usr/local/bin
PATH: /usr/sbin
PATH: /usr/bin
PATH: /sbin
PATH: /bin
PATH: /opt/bin
PATH: /usr/i686-pc-linux-gnu/gcc-bin/4.1.1
PATH: /opt/sun-jdk-1.4.2.13/bin
PATH: /opt/sun-jdk-1.4.2.13/jre/bin
PATH: /opt/sun-jdk-1.4.2.13/jre/javaws
PATH: /usr/kde/3.5/sbin
PATH: /usr/kde/3.5/bin
PATH: /usr/qt/3/bin
PATH: /opt/firebird/bin


## ----------- ##
## Core tests. ##
## ----------- ##

configure:1993: checking build system type
configure:2011: result: i686-pc-linux-gnu
configure:2033: checking host system type
configure:2048: result: i686-pc-linux-gnu
configure:2135: checking for gcc
configure:2151: found /usr/bin/gcc
configure:2162: result: gcc
configure:2400: checking for C compiler version
configure:2407: gcc --version >&5
gcc (GCC) 4.1.1 (Gentoo 4.1.1-r3)
Copyright (C) 2006 Free Software Foundation, Inc.
This is free software; see the source for copying conditions.  There is NO
warranty; not even for MERCHANTABILITY or FITNESS FOR A PARTICULAR PURPOSE.

configure:2410: $? = 0
configure:2417: gcc -v >&5
Using built-in specs.
Target: i686-pc-linux-gnu
Configured with: /var/tmp/portage/sys-devel/gcc-4.1.1-r3/work/gcc-4.1.1/configure --prefix=/usr --bindir=/usr/i686-pc-linux-gnu/gcc-bin/4.1.1 --includedir=/usr/lib/gcc/i686-pc-linux-gnu/4.1.1/include --datadir=/usr/share/gcc-data/i686-pc-linux-gnu/4.1.1 --mandir=/usr/share/gcc-data/i686-pc-linux-gnu/4.1.1/man --infodir=/usr/share/gcc-data/i686-pc-linux-gnu/4.1.1/info --with-gxx-include-dir=/usr/lib/gcc/i686-pc-linux-gnu/4.1.1/include/g++-v4 --host=i686-pc-linux-gnu --build=i686-pc-linux-gnu --disable-altivec --enable-nls --without-included-gettext --with-system-zlib --disable-checking --disable-werror --enable-secureplt --disable-libunwind-exceptions --disable-multilib --disable-libmudflap --disable-libssp --disable-libgcj --enable-languages=c,c++,objc,fortran --enable-shared --enable-threads=posix --enable-__cxa_atexit --enable-clocale=gnu
Thread model: posix
gcc version 4.1.1 (Gentoo 4.1.1-r3)
configure:2420: $? = 0
configure:2427: gcc -V >&5
gcc: '-V' option must have argument
configure:2430: $? = 1
configure:2453: checking for C compiler default output file name
configure:2480: gcc -O2 -march=pentium4 -pipe -fomit-frame-pointer   conftest.c  >&5
configure:2483: $? = 0
configure:2529: result: a.out
configure:2534: checking whether the C compiler works
configure:2544: ./a.out
configure:2547: $? = 0
configure:2564: result: yes
configure:2571: checking whether we are cross compiling
configure:2573: result: no
configure:2576: checking for suffix of executables
configure:2583: gcc -o conftest -O2 -march=pentium4 -pipe -fomit-frame-pointer   conftest.c  >&5
configure:2586: $? = 0
configure:2610: result:
configure:2616: checking for suffix of object files
configure:2642: gcc -c -O2 -march=pentium4 -pipe -fomit-frame-pointer  conftest.c >&5
configure:2645: $? = 0
configure:2668: result: o
configure:2672: checking whether we are using the GNU C compiler
configure:2701: gcc -c -O2 -march=pentium4 -pipe -fomit-frame-pointer  conftest.c >&5
configure:2707: $? = 0
configure:2714: test -z "$ac_c_werror_flag" || test ! -s conftest.err
configure:2717: $? = 0
configure:2724: test -s conftest.o
configure:2727: $? = 0
configure:2741: result: yes
configure:2746: checking whether gcc accepts -g
configure:2776: gcc -c -g  conftest.c >&5
configure:2782: $? = 0
configure:2789: test -z "$ac_c_werror_flag" || test ! -s conftest.err
configure:2792: $? = 0
configure:2799: test -s conftest.o
configure:2802: $? = 0
configure:2932: result: yes
configure:2949: checking for gcc option to accept ISO C89
configure:3023: gcc  -c -O2 -march=pentium4 -pipe -fomit-frame-pointer  conftest.c >&5
configure:3029: $? = 0
configure:3036: test -z "$ac_c_werror_flag" || test ! -s conftest.err
configure:3039: $? = 0
configure:3046: test -s conftest.o
configure:3049: $? = 0
configure:3069: result: none needed
configure:3093: checking how to run the C preprocessor
configure:3133: gcc -E  conftest.c
configure:3139: $? = 0
configure:3177: gcc -E  conftest.c
conftest.c:9:28: error: ac_nonexistent.h: No such file or directory
configure:3183: $? = 1
configure: failed program was:
| /* confdefs.h.  */
| #define PACKAGE_NAME ""
| #define PACKAGE_TARNAME ""
| #define PACKAGE_VERSION ""
| #define PACKAGE_STRING ""
| #define PACKAGE_BUGREPORT ""
| #define _GNU_SOURCE 1
| /* end confdefs.h.  */
| #include <ac_nonexistent.h>
configure:3223: result: gcc -E
configure:3252: gcc -E  conftest.c
configure:3258: $? = 0
configure:3296: gcc -E  conftest.c
conftest.c:9:28: error: ac_nonexistent.h: No such file or directory
configure:3302: $? = 1
configure: failed program was:
| /* confdefs.h.  */
| #define PACKAGE_NAME ""
| #define PACKAGE_TARNAME ""
| #define PACKAGE_VERSION ""
| #define PACKAGE_STRING ""
| #define PACKAGE_BUGREPORT ""
| #define _GNU_SOURCE 1
| /* end confdefs.h.  */
| #include <ac_nonexistent.h>
configure:3347: checking for grep that handles long lines and -e
configure:3421: result: /bin/grep
configure:3426: checking for egrep
configure:3504: result: /bin/grep -E
configure:3510: checking for AIX
configure:3532: result: no
configure:3538: checking for ANSI C header files
configure:3568: gcc -c -O2 -march=pentium4 -pipe -fomit-frame-pointer  conftest.c >&5
configure:3574: $? = 0
configure:3581: test -z "$ac_c_werror_flag" || test ! -s conftest.err
configure:3584: $? = 0
configure:3591: test -s conftest.o
configure:3594: $? = 0
configure:3690: gcc -o conftest -O2 -march=pentium4 -pipe -fomit-frame-pointer   conftest.c  >&5
configure:3693: $? = 0
configure:3699: ./conftest
configure:3702: $? = 0
configure:3719: result: yes
configure:3743: checking for sys/types.h
configure:3764: gcc -c -O2 -march=pentium4 -pipe -fomit-frame-pointer  conftest.c >&5
configure:3770: $? = 0
configure:3777: test -z "$ac_c_werror_flag" || test ! -s conftest.err
configure:3780: $? = 0
configure:3787: test -s conftest.o
configure:3790: $? = 0
configure:3803: result: yes
configure:3743: checking for sys/stat.h
configure:3764: gcc -c -O2 -march=pentium4 -pipe -fomit-frame-pointer  conftest.c >&5
configure:3770: $? = 0
configure:3777: test -z "$ac_c_werror_flag" || test ! -s conftest.err
configure:3780: $? = 0
configure:3787: test -s conftest.o
configure:3790: $? = 0
configure:3803: result: yes
configure:3743: checking for stdlib.h
configure:3764: gcc -c -O2 -march=pentium4 -pipe -fomit-frame-pointer  conftest.c >&5
configure:3770: $? = 0
configure:3777: test -z "$ac_c_werror_flag" || test ! -s conftest.err
configure:3780: $? = 0
configure:3787: test -s conftest.o
configure:3790: $? = 0
configure:3803: result: yes
configure:3743: checking for string.h
configure:3764: gcc -c -O2 -march=pentium4 -pipe -fomit-frame-pointer  conftest.c >&5
configure:3770: $? = 0
configure:3777: test -z "$ac_c_werror_flag" || test ! -s conftest.err
configure:3780: $? = 0
configure:3787: test -s conftest.o
configure:3790: $? = 0
configure:3803: result: yes
configure:3743: checking for memory.h
configure:3764: gcc -c -O2 -march=pentium4 -pipe -fomit-frame-pointer  conftest.c >&5
configure:3770: $? = 0
configure:3777: test -z "$ac_c_werror_flag" || test ! -s conftest.err
configure:3780: $? = 0
configure:3787: test -s conftest.o
configure:3790: $? = 0
configure:3803: result: yes
configure:3743: checking for strings.h
configure:3764: gcc -c -O2 -march=pentium4 -pipe -fomit-frame-pointer  conftest.c >&5
configure:3770: $? = 0
configure:3777: test -z "$ac_c_werror_flag" || test ! -s conftest.err
configure:3780: $? = 0
configure:3787: test -s conftest.o
configure:3790: $? = 0
configure:3803: result: yes
configure:3743: checking for inttypes.h
configure:3764: gcc -c -O2 -march=pentium4 -pipe -fomit-frame-pointer  conftest.c >&5
configure:3770: $? = 0
configure:3777: test -z "$ac_c_werror_flag" || test ! -s conftest.err
configure:3780: $? = 0
configure:3787: test -s conftest.o
configure:3790: $? = 0
configure:3803: result: yes
configure:3743: checking for stdint.h
configure:3764: gcc -c -O2 -march=pentium4 -pipe -fomit-frame-pointer  conftest.c >&5
configure:3770: $? = 0
configure:3777: test -z "$ac_c_werror_flag" || test ! -s conftest.err
configure:3780: $? = 0
configure:3787: test -s conftest.o
configure:3790: $? = 0
configure:3803: result: yes
configure:3743: checking for unistd.h
configure:3764: gcc -c -O2 -march=pentium4 -pipe -fomit-frame-pointer  conftest.c >&5
configure:3770: $? = 0
configure:3777: test -z "$ac_c_werror_flag" || test ! -s conftest.err
configure:3780: $? = 0
configure:3787: test -s conftest.o
configure:3790: $? = 0
configure:3803: result: yes
configure:3825: checking minix/config.h usability
configure:3842: gcc -c -O2 -march=pentium4 -pipe -fomit-frame-pointer  conftest.c >&5
conftest.c:52:26: error: minix/config.h: No such file or directory
configure:3848: $? = 1
configure: failed program was:
| /* confdefs.h.  */
| #define PACKAGE_NAME ""
| #define PACKAGE_TARNAME ""
| #define PACKAGE_VERSION ""
| #define PACKAGE_STRING ""
| #define PACKAGE_BUGREPORT ""
| #define _GNU_SOURCE 1
| #define STDC_HEADERS 1
| #define HAVE_SYS_TYPES_H 1
| #define HAVE_SYS_STAT_H 1
| #define HAVE_STDLIB_H 1
| #define HAVE_STRING_H 1
| #define HAVE_MEMORY_H 1
| #define HAVE_STRINGS_H 1
| #define HAVE_INTTYPES_H 1
| #define HAVE_STDINT_H 1
| #define HAVE_UNISTD_H 1
| /* end confdefs.h.  */
| #include <stdio.h>
| #if HAVE_SYS_TYPES_H
| # include <sys/types.h>
| #endif
| #if HAVE_SYS_STAT_H
| # include <sys/stat.h>
| #endif
| #if STDC_HEADERS
| # include <stdlib.h>
| # include <stddef.h>
| #else
| # if HAVE_STDLIB_H
| #  include <stdlib.h>
| # endif
| #endif
| #if HAVE_STRING_H
| # if !STDC_HEADERS && HAVE_MEMORY_H
| #  include <memory.h>
| # endif
| # include <string.h>
| #endif
| #if HAVE_STRINGS_H
| # include <strings.h>
| #endif
| #if HAVE_INTTYPES_H
| # include <inttypes.h>
| #endif
| #if HAVE_STDINT_H
| # include <stdint.h>
| #endif
| #if HAVE_UNISTD_H
| # include <unistd.h>
| #endif
| #include <minix/config.h>
configure:3879: result: no
configure:3883: checking minix/config.h presence
configure:3898: gcc -E  conftest.c
conftest.c:19:26: error: minix/config.h: No such file or directory
configure:3904: $? = 1
configure: failed program was:
| /* confdefs.h.  */
| #define PACKAGE_NAME ""
| #define PACKAGE_TARNAME ""
| #define PACKAGE_VERSION ""
| #define PACKAGE_STRING ""
| #define PACKAGE_BUGREPORT ""
| #define _GNU_SOURCE 1
| #define STDC_HEADERS 1
| #define HAVE_SYS_TYPES_H 1
| #define HAVE_SYS_STAT_H 1
| #define HAVE_STDLIB_H 1
| #define HAVE_STRING_H 1
| #define HAVE_MEMORY_H 1
| #define HAVE_STRINGS_H 1
| #define HAVE_INTTYPES_H 1
| #define HAVE_STDINT_H 1
| #define HAVE_UNISTD_H 1
| /* end confdefs.h.  */
| #include <minix/config.h>
configure:3925: result: no
configure:3953: checking for minix/config.h
configure:3960: result: no
configure:3999: checking whether it is safe to define __EXTENSIONS__
configure:4027: gcc -c -O2 -march=pentium4 -pipe -fomit-frame-pointer  conftest.c >&5
configure:4033: $? = 0
configure:4040: test -z "$ac_c_werror_flag" || test ! -s conftest.err
configure:4043: $? = 0
configure:4050: test -s conftest.o
configure:4053: $? = 0
configure:4065: result: yes
configure:4186: checking for uname
configure:4204: found /bin/uname
configure:4216: result: /bin/uname
configure:4787: checking for gcc
configure:4814: result: gcc
configure:5052: checking for C compiler version
configure:5059: gcc --version >&5
gcc (GCC) 4.1.1 (Gentoo 4.1.1-r3)
Copyright (C) 2006 Free Software Foundation, Inc.
This is free software; see the source for copying conditions.  There is NO
warranty; not even for MERCHANTABILITY or FITNESS FOR A PARTICULAR PURPOSE.

configure:5062: $? = 0
configure:5069: gcc -v >&5
Using built-in specs.
Target: i686-pc-linux-gnu
Configured with: /var/tmp/portage/sys-devel/gcc-4.1.1-r3/work/gcc-4.1.1/configure --prefix=/usr --bindir=/usr/i686-pc-linux-gnu/gcc-bin/4.1.1 --includedir=/usr/lib/gcc/i686-pc-linux-gnu/4.1.1/include --datadir=/usr/share/gcc-data/i686-pc-linux-gnu/4.1.1 --mandir=/usr/share/gcc-data/i686-pc-linux-gnu/4.1.1/man --infodir=/usr/share/gcc-data/i686-pc-linux-gnu/4.1.1/info --with-gxx-include-dir=/usr/lib/gcc/i686-pc-linux-gnu/4.1.1/include/g++-v4 --host=i686-pc-linux-gnu --build=i686-pc-linux-gnu --disable-altivec --enable-nls --without-included-gettext --with-system-zlib --disable-checking --disable-werror --enable-secureplt --disable-libunwind-exceptions --disable-multilib --disable-libmudflap --disable-libssp --disable-libgcj --enable-languages=c,c++,objc,fortran --enable-shared --enable-threads=posix --enable-__cxa_atexit --enable-clocale=gnu
Thread model: posix
gcc version 4.1.1 (Gentoo 4.1.1-r3)
configure:5072: $? = 0
configure:5079: gcc -V >&5
gcc: '-V' option must have argument
configure:5082: $? = 1
configure:5085: checking whether we are using the GNU C compiler
configure:5154: result: yes
configure:5159: checking whether gcc accepts -g
configure:5345: result: yes
configure:5362: checking for gcc option to accept ISO C89
configure:5482: result: none needed
configure:5558: checking for g++
configure:5574: found /usr/bin/g++
configure:5585: result: g++
configure:5616: checking for C++ compiler version
configure:5623: g++ --version >&5
g++ (GCC) 4.1.1 (Gentoo 4.1.1-r3)
Copyright (C) 2006 Free Software Foundation, Inc.
This is free software; see the source for copying conditions.  There is NO
warranty; not even for MERCHANTABILITY or FITNESS FOR A PARTICULAR PURPOSE.

configure:5626: $? = 0
configure:5633: g++ -v >&5
Using built-in specs.
Target: i686-pc-linux-gnu
Configured with: /var/tmp/portage/sys-devel/gcc-4.1.1-r3/work/gcc-4.1.1/configure --prefix=/usr --bindir=/usr/i686-pc-linux-gnu/gcc-bin/4.1.1 --includedir=/usr/lib/gcc/i686-pc-linux-gnu/4.1.1/include --datadir=/usr/share/gcc-data/i686-pc-linux-gnu/4.1.1 --mandir=/usr/share/gcc-data/i686-pc-linux-gnu/4.1.1/man --infodir=/usr/share/gcc-data/i686-pc-linux-gnu/4.1.1/info --with-gxx-include-dir=/usr/lib/gcc/i686-pc-linux-gnu/4.1.1/include/g++-v4 --host=i686-pc-linux-gnu --build=i686-pc-linux-gnu --disable-altivec --enable-nls --without-included-gettext --with-system-zlib --disable-checking --disable-werror --enable-secureplt --disable-libunwind-exceptions --disable-multilib --disable-libmudflap --disable-libssp --disable-libgcj --enable-languages=c,c++,objc,fortran --enable-shared --enable-threads=posix --enable-__cxa_atexit --enable-clocale=gnu
Thread model: posix
gcc version 4.1.1 (Gentoo 4.1.1-r3)
configure:5636: $? = 0
configure:5643: g++ -V >&5
g++: '-V' option must have argument
configure:5646: $? = 1
configure:5649: checking whether we are using the GNU C++ compiler
configure:5678: g++ -c -O2 -march=pentium4 -pipe -fomit-frame-pointer  conftest.cpp >&5
configure:5684: $? = 0
configure:5691: test -z "$ac_cxx_werror_flag" || test ! -s conftest.err
configure:5694: $? = 0
configure:5701: test -s conftest.o
configure:5704: $? = 0
configure:5718: result: yes
configure:5723: checking whether g++ accepts -g
configure:5753: g++ -c -g  conftest.cpp >&5
configure:5759: $? = 0
configure:5766: test -z "$ac_cxx_werror_flag" || test ! -s conftest.err
configure:5769: $? = 0
configure:5776: test -s conftest.o
configure:5779: $? = 0
configure:5909: result: yes
configure:5937: checking how to run the C preprocessor
configure:6067: result: gcc -E
configure:6096: gcc -E  conftest.c
configure:6102: $? = 0
configure:6140: gcc -E  conftest.c
conftest.c:21:28: error: ac_nonexistent.h: No such file or directory
configure:6146: $? = 1
configure: failed program was:
| /* confdefs.h.  */
| #define PACKAGE_NAME ""
| #define PACKAGE_TARNAME ""
| #define PACKAGE_VERSION ""
| #define PACKAGE_STRING ""
| #define PACKAGE_BUGREPORT ""
| #define _GNU_SOURCE 1
| #define STDC_HEADERS 1
| #define HAVE_SYS_TYPES_H 1
| #define HAVE_SYS_STAT_H 1
| #define HAVE_STDLIB_H 1
| #define HAVE_STRING_H 1
| #define HAVE_MEMORY_H 1
| #define HAVE_STRINGS_H 1
| #define HAVE_INTTYPES_H 1
| #define HAVE_STDINT_H 1
| #define HAVE_UNISTD_H 1
| #define __EXTENSIONS__ 1
| #define _POSIX_PTHREAD_SEMANTICS 1
| /* end confdefs.h.  */
| #include <ac_nonexistent.h>
configure:6195: checking how to run the C++ preprocessor
configure:6231: g++ -E  conftest.cpp
configure:6237: $? = 0
configure:6275: g++ -E  conftest.cpp
conftest.cpp:21:28: error: ac_nonexistent.h: No such file or directory
configure:6281: $? = 1
configure: failed program was:
| /* confdefs.h.  */
| #define PACKAGE_NAME ""
| #define PACKAGE_TARNAME ""
| #define PACKAGE_VERSION ""
| #define PACKAGE_STRING ""
| #define PACKAGE_BUGREPORT ""
| #define _GNU_SOURCE 1
| #define STDC_HEADERS 1
| #define HAVE_SYS_TYPES_H 1
| #define HAVE_SYS_STAT_H 1
| #define HAVE_STDLIB_H 1
| #define HAVE_STRING_H 1
| #define HAVE_MEMORY_H 1
| #define HAVE_STRINGS_H 1
| #define HAVE_INTTYPES_H 1
| #define HAVE_STDINT_H 1
| #define HAVE_UNISTD_H 1
| #define __EXTENSIONS__ 1
| #define _POSIX_PTHREAD_SEMANTICS 1
| /* end confdefs.h.  */
| #include <ac_nonexistent.h>
configure:6321: result: g++ -E
configure:6350: g++ -E  conftest.cpp
configure:6356: $? = 0
configure:6394: g++ -E  conftest.cpp
conftest.cpp:21:28: error: ac_nonexistent.h: No such file or directory
configure:6400: $? = 1
configure: failed program was:
| /* confdefs.h.  */
| #define PACKAGE_NAME ""
| #define PACKAGE_TARNAME ""
| #define PACKAGE_VERSION ""
| #define PACKAGE_STRING ""
| #define PACKAGE_BUGREPORT ""
| #define _GNU_SOURCE 1
| #define STDC_HEADERS 1
| #define HAVE_SYS_TYPES_H 1
| #define HAVE_SYS_STAT_H 1
| #define HAVE_STDLIB_H 1
| #define HAVE_STRING_H 1
| #define HAVE_MEMORY_H 1
| #define HAVE_STRINGS_H 1
| #define HAVE_INTTYPES_H 1
| #define HAVE_STDINT_H 1
| #define HAVE_UNISTD_H 1
| #define __EXTENSIONS__ 1
| #define _POSIX_PTHREAD_SEMANTICS 1
| /* end confdefs.h.  */
| #include <ac_nonexistent.h>
configure:6446: checking for a sed that does not truncate output
configure:6525: result: /usr/bin/sed
configure:6530: checking for egrep
configure:6540: result: grep -E
configure:6556: checking for ld used by gcc
configure:6623: result: /usr/i686-pc-linux-gnu/bin/ld
configure:6632: checking if the linker (/usr/i686-pc-linux-gnu/bin/ld) is GNU ld
configure:6647: result: yes
configure:6656: checking for gawk
configure:6672: found /usr/bin/gawk
configure:6683: result: gawk
configure:6707: checking for a BSD-compatible install
configure:6763: result: /usr/bin/install -c
configure:6774: checking whether ln -s works
configure:6778: result: yes
configure:6828: checking for ranlib
configure:6844: found /usr/bin/ranlib
configure:6855: result: ranlib
configure:6881: checking for GNU make
configure:6900: result: make
configure:6919: checking for grep
configure:6950: result: /bin/grep
configure:6960: checking for ar
configure:6978: found /usr/bin/ar
configure:6991: result: /usr/bin/ar
configure:7001: checking for find
configure:7019: found /usr/bin/find
configure:7032: result: /usr/bin/find
configure:7042: checking for compress
configure:7073: result: :
configure:7083: checking for basename
configure:7101: found /usr/bin/basename
configure:7114: result: /usr/bin/basename
configure:7124: checking for id
configure:7142: found /usr/bin/id
configure:7155: result: /usr/bin/id
configure:7165: checking for dirname
configure:7183: found /usr/bin/dirname
configure:7196: result: /usr/bin/dirname
configure:7206: checking for sh
configure:7237: result: /bin/sh
configure:7247: checking for ln
configure:7265: found /bin/ln
configure:7278: result: /bin/ln
configure:7288: checking for dot
configure:7306: found /usr/bin/dot
configure:7319: result: /usr/bin/dot
configure:7329: checking for strip
configure:7347: found /usr/bin/strip
configure:7360: result: /usr/bin/strip
configure:7370: checking for wget
configure:7388: found /usr/bin/wget
configure:7401: result: /usr/bin/wget
configure:7411: checking for rubber
configure:7442: result: :
configure:7706: checking for the pthreads library -lpthreads
configure:7749: gcc -o conftest -O2 -march=pentium4 -pipe -fomit-frame-pointer    conftest.c -lpthreads  >&5
/usr/lib/gcc/i686-pc-linux-gnu/4.1.1/../../../../i686-pc-linux-gnu/bin/ld: cannot find -lpthreads
collect2: ld returned 1 exit status
configure:7755: $? = 1
configure: failed program was:
| /* confdefs.h.  */
| #define PACKAGE_NAME ""
| #define PACKAGE_TARNAME ""
| #define PACKAGE_VERSION ""
| #define PACKAGE_STRING ""
| #define PACKAGE_BUGREPORT ""
| #define _GNU_SOURCE 1
| #define STDC_HEADERS 1
| #define HAVE_SYS_TYPES_H 1
| #define HAVE_SYS_STAT_H 1
| #define HAVE_STDLIB_H 1
| #define HAVE_STRING_H 1
| #define HAVE_MEMORY_H 1
| #define HAVE_STRINGS_H 1
| #define HAVE_INTTYPES_H 1
| #define HAVE_STDINT_H 1
| #define HAVE_UNISTD_H 1
| #define __EXTENSIONS__ 1
| #define _POSIX_PTHREAD_SEMANTICS 1
| /* end confdefs.h.  */
| #include <pthread.h>
| int
| main ()
| {
| pthread_t th; pthread_join(th, 0);
|                      pthread_attr_init(0); pthread_cleanup_push(0, 0);
|                      pthread_create(0,0,0,0); pthread_cleanup_pop(0);
|   ;
|   return 0;
| }
configure:7791: result: no
configure:7651: checking whether pthreads work without any flags
configure:7749: gcc -o conftest -O2 -march=pentium4 -pipe -fomit-frame-pointer    conftest.c   >&5
/tmp/cc9sHyNd.o: In function `main':
conftest.c:(.text+0x1b): undefined reference to `pthread_join'
conftest.c:(.text+0x4a): undefined reference to `__pthread_register_cancel'
conftest.c:(.text+0x6e): undefined reference to `pthread_create'
conftest.c:(.text+0x75): undefined reference to `__pthread_unregister_cancel'
collect2: ld returned 1 exit status
configure:7755: $? = 1
configure: failed program was:
| /* confdefs.h.  */
| #define PACKAGE_NAME ""
| #define PACKAGE_TARNAME ""
| #define PACKAGE_VERSION ""
| #define PACKAGE_STRING ""
| #define PACKAGE_BUGREPORT ""
| #define _GNU_SOURCE 1
| #define STDC_HEADERS 1
| #define HAVE_SYS_TYPES_H 1
| #define HAVE_SYS_STAT_H 1
| #define HAVE_STDLIB_H 1
| #define HAVE_STRING_H 1
| #define HAVE_MEMORY_H 1
| #define HAVE_STRINGS_H 1
| #define HAVE_INTTYPES_H 1
| #define HAVE_STDINT_H 1
| #define HAVE_UNISTD_H 1
| #define __EXTENSIONS__ 1
| #define _POSIX_PTHREAD_SEMANTICS 1
| /* end confdefs.h.  */
| #include <pthread.h>
| int
| main ()
| {
| pthread_t th; pthread_join(th, 0);
|                      pthread_attr_init(0); pthread_cleanup_push(0, 0);
|                      pthread_create(0,0,0,0); pthread_cleanup_pop(0);
|   ;
|   return 0;
| }
configure:7791: result: no
configure:7656: checking whether pthreads work with -Kthread
configure:7749: gcc -o conftest -O2 -march=pentium4 -pipe -fomit-frame-pointer -Kthread   conftest.c   >&5
gcc: unrecognized option '-Kthread'
/tmp/ccTDzrxg.o: In function `main':
conftest.c:(.text+0x1b): undefined reference to `pthread_join'
conftest.c:(.text+0x4a): undefined reference to `__pthread_register_cancel'
conftest.c:(.text+0x6e): undefined reference to `pthread_create'
conftest.c:(.text+0x75): undefined reference to `__pthread_unregister_cancel'
collect2: ld returned 1 exit status
configure:7755: $? = 1
configure: failed program was:
| /* confdefs.h.  */
| #define PACKAGE_NAME ""
| #define PACKAGE_TARNAME ""
| #define PACKAGE_VERSION ""
| #define PACKAGE_STRING ""
| #define PACKAGE_BUGREPORT ""
| #define _GNU_SOURCE 1
| #define STDC_HEADERS 1
| #define HAVE_SYS_TYPES_H 1
| #define HAVE_SYS_STAT_H 1
| #define HAVE_STDLIB_H 1
| #define HAVE_STRING_H 1
| #define HAVE_MEMORY_H 1
| #define HAVE_STRINGS_H 1
| #define HAVE_INTTYPES_H 1
| #define HAVE_STDINT_H 1
| #define HAVE_UNISTD_H 1
| #define __EXTENSIONS__ 1
| #define _POSIX_PTHREAD_SEMANTICS 1
| /* end confdefs.h.  */
| #include <pthread.h>
| int
| main ()
| {
| pthread_t th; pthread_join(th, 0);
|                      pthread_attr_init(0); pthread_cleanup_push(0, 0);
|                      pthread_create(0,0,0,0); pthread_cleanup_pop(0);
|   ;
|   return 0;
| }
configure:7791: result: no
configure:7656: checking whether pthreads work with -kthread
configure:7749: gcc -o conftest -O2 -march=pentium4 -pipe -fomit-frame-pointer -kthread   conftest.c   >&5
gcc: unrecognized option '-kthread'
/tmp/ccMFtfaq.o: In function `main':
conftest.c:(.text+0x1b): undefined reference to `pthread_join'
conftest.c:(.text+0x4a): undefined reference to `__pthread_register_cancel'
conftest.c:(.text+0x6e): undefined reference to `pthread_create'
conftest.c:(.text+0x75): undefined reference to `__pthread_unregister_cancel'
collect2: ld returned 1 exit status
configure:7755: $? = 1
configure: failed program was:
| /* confdefs.h.  */
| #define PACKAGE_NAME ""
| #define PACKAGE_TARNAME ""
| #define PACKAGE_VERSION ""
| #define PACKAGE_STRING ""
| #define PACKAGE_BUGREPORT ""
| #define _GNU_SOURCE 1
| #define STDC_HEADERS 1
| #define HAVE_SYS_TYPES_H 1
| #define HAVE_SYS_STAT_H 1
| #define HAVE_STDLIB_H 1
| #define HAVE_STRING_H 1
| #define HAVE_MEMORY_H 1
| #define HAVE_STRINGS_H 1
| #define HAVE_INTTYPES_H 1
| #define HAVE_STDINT_H 1
| #define HAVE_UNISTD_H 1
| #define __EXTENSIONS__ 1
| #define _POSIX_PTHREAD_SEMANTICS 1
| /* end confdefs.h.  */
| #include <pthread.h>
| int
| main ()
| {
| pthread_t th; pthread_join(th, 0);
|                      pthread_attr_init(0); pthread_cleanup_push(0, 0);
|                      pthread_create(0,0,0,0); pthread_cleanup_pop(0);
|   ;
|   return 0;
| }
configure:7791: result: no
configure:7706: checking for the pthreads library -llthread
configure:7749: gcc -o conftest -O2 -march=pentium4 -pipe -fomit-frame-pointer    conftest.c -llthread  >&5
/usr/lib/gcc/i686-pc-linux-gnu/4.1.1/../../../../i686-pc-linux-gnu/bin/ld: cannot find -llthread
collect2: ld returned 1 exit status
configure:7755: $? = 1
configure: failed program was:
| /* confdefs.h.  */
| #define PACKAGE_NAME ""
| #define PACKAGE_TARNAME ""
| #define PACKAGE_VERSION ""
| #define PACKAGE_STRING ""
| #define PACKAGE_BUGREPORT ""
| #define _GNU_SOURCE 1
| #define STDC_HEADERS 1
| #define HAVE_SYS_TYPES_H 1
| #define HAVE_SYS_STAT_H 1
| #define HAVE_STDLIB_H 1
| #define HAVE_STRING_H 1
| #define HAVE_MEMORY_H 1
| #define HAVE_STRINGS_H 1
| #define HAVE_INTTYPES_H 1
| #define HAVE_STDINT_H 1
| #define HAVE_UNISTD_H 1
| #define __EXTENSIONS__ 1
| #define _POSIX_PTHREAD_SEMANTICS 1
| /* end confdefs.h.  */
| #include <pthread.h>
| int
| main ()
| {
| pthread_t th; pthread_join(th, 0);
|                      pthread_attr_init(0); pthread_cleanup_push(0, 0);
|                      pthread_create(0,0,0,0); pthread_cleanup_pop(0);
|   ;
|   return 0;
| }
configure:7791: result: no
configure:7656: checking whether pthreads work with -pthread
configure:7749: gcc -o conftest -O2 -march=pentium4 -pipe -fomit-frame-pointer -pthread   conftest.c   >&5
configure:7755: $? = 0
configure:7762: test -z "$ac_c_werror_flag" || test ! -s conftest.err
configure:7765: $? = 0
configure:7772: test -s conftest
configure:7775: $? = 0
configure:7791: result: yes
configure:7810: checking for joinable pthread attribute
configure:7835: gcc -o conftest -O2 -march=pentium4 -pipe -fomit-frame-pointer -pthread   conftest.c   >&5
configure:7841: $? = 0
configure:7848: test -z "$ac_c_werror_flag" || test ! -s conftest.err
configure:7851: $? = 0
configure:7858: test -s conftest
configure:7861: $? = 0
configure:7874: result: PTHREAD_CREATE_JOINABLE
configure:7884: checking if more special flags are required for pthreads
configure:7891: result: no
configure:9041: checking for working alloca.h
configure:9068: gcc -o conftest -O2 -march=pentium4 -pipe -fomit-frame-pointer   conftest.c  >&5
configure:9074: $? = 0
configure:9081: test -z "$ac_c_werror_flag" || test ! -s conftest.err
configure:9084: $? = 0
configure:9091: test -s conftest
configure:9094: $? = 0
configure:9107: result: yes
configure:9117: checking for alloca
configure:9164: gcc -o conftest -O2 -march=pentium4 -pipe -fomit-frame-pointer   conftest.c  >&5
configure:9170: $? = 0
configure:9177: test -z "$ac_c_werror_flag" || test ! -s conftest.err
configure:9180: $? = 0
configure:9187: test -s conftest
configure:9190: $? = 0
configure:9203: result: yes
configure:9454: checking for dirent.h that defines DIR
configure:9483: gcc -c -O2 -march=pentium4 -pipe -fomit-frame-pointer  conftest.c >&5
configure:9489: $? = 0
configure:9496: test -z "$ac_c_werror_flag" || test ! -s conftest.err
configure:9499: $? = 0
configure:9506: test -s conftest.o
configure:9509: $? = 0
configure:9522: result: yes
configure:9535: checking for library containing opendir
configure:9576: gcc -o conftest -O2 -march=pentium4 -pipe -fomit-frame-pointer   conftest.c  >&5
configure:9582: $? = 0
configure:9589: test -z "$ac_c_werror_flag" || test ! -s conftest.err
configure:9592: $? = 0
configure:9599: test -s conftest
configure:9602: $? = 0
configure:9626: result: none required
configure:9736: checking for ANSI C header files
configure:9917: result: yes
configure:9927: checking for sys/wait.h that is POSIX.1 compatible
configure:9963: gcc -c -O2 -march=pentium4 -pipe -fomit-frame-pointer  conftest.c >&5
configure:9969: $? = 0
configure:9976: test -z "$ac_c_werror_flag" || test ! -s conftest.err
configure:9979: $? = 0
configure:9986: test -s conftest.o
configure:9989: $? = 0
configure:10001: result: yes
configure:10048: checking arpa/inet.h usability
configure:10065: gcc -c -O2 -march=pentium4 -pipe -fomit-frame-pointer  conftest.c >&5
configure:10071: $? = 0
configure:10078: test -z "$ac_c_werror_flag" || test ! -s conftest.err
configure:10081: $? = 0
configure:10088: test -s conftest.o
configure:10091: $? = 0
configure:10102: result: yes
configure:10106: checking arpa/inet.h presence
configure:10121: gcc -E  conftest.c
configure:10127: $? = 0
configure:10148: result: yes
configure:10176: checking for arpa/inet.h
configure:10184: result: yes
configure:10048: checking fcntl.h usability
configure:10065: gcc -c -O2 -march=pentium4 -pipe -fomit-frame-pointer  conftest.c >&5
configure:10071: $? = 0
configure:10078: test -z "$ac_c_werror_flag" || test ! -s conftest.err
configure:10081: $? = 0
configure:10088: test -s conftest.o
configure:10091: $? = 0
configure:10102: result: yes
configure:10106: checking fcntl.h presence
configure:10121: gcc -E  conftest.c
configure:10127: $? = 0
configure:10148: result: yes
configure:10176: checking for fcntl.h
configure:10184: result: yes
configure:10038: checking for inttypes.h
configure:10044: result: yes
configure:10048: checking libintl.h usability
configure:10065: gcc -c -O2 -march=pentium4 -pipe -fomit-frame-pointer  conftest.c >&5
configure:10071: $? = 0
configure:10078: test -z "$ac_c_werror_flag" || test ! -s conftest.err
configure:10081: $? = 0
configure:10088: test -s conftest.o
configure:10091: $? = 0
configure:10102: result: yes
configure:10106: checking libintl.h presence
configure:10121: gcc -E  conftest.c
configure:10127: $? = 0
configure:10148: result: yes
configure:10176: checking for libintl.h
configure:10184: result: yes
configure:10048: checking limits.h usability
configure:10065: gcc -c -O2 -march=pentium4 -pipe -fomit-frame-pointer  conftest.c >&5
configure:10071: $? = 0
configure:10078: test -z "$ac_c_werror_flag" || test ! -s conftest.err
configure:10081: $? = 0
configure:10088: test -s conftest.o
configure:10091: $? = 0
configure:10102: result: yes
configure:10106: checking limits.h presence
configure:10121: gcc -E  conftest.c
configure:10127: $? = 0
configure:10148: result: yes
configure:10176: checking for limits.h
configure:10184: result: yes
configure:10048: checking locale.h usability
configure:10065: gcc -c -O2 -march=pentium4 -pipe -fomit-frame-pointer  conftest.c >&5
configure:10071: $? = 0
configure:10078: test -z "$ac_c_werror_flag" || test ! -s conftest.err
configure:10081: $? = 0
configure:10088: test -s conftest.o
configure:10091: $? = 0
configure:10102: result: yes
configure:10106: checking locale.h presence
configure:10121: gcc -E  conftest.c
configure:10127: $? = 0
configure:10148: result: yes
configure:10176: checking for locale.h
configure:10184: result: yes
configure:10048: checking malloc.h usability
configure:10065: gcc -c -O2 -march=pentium4 -pipe -fomit-frame-pointer  conftest.c >&5
configure:10071: $? = 0
configure:10078: test -z "$ac_c_werror_flag" || test ! -s conftest.err
configure:10081: $? = 0
configure:10088: test -s conftest.o
configure:10091: $? = 0
configure:10102: result: yes
configure:10106: checking malloc.h presence
configure:10121: gcc -E  conftest.c
configure:10127: $? = 0
configure:10148: result: yes
configure:10176: checking for malloc.h
configure:10184: result: yes
configure:10048: checking netdb.h usability
configure:10065: gcc -c -O2 -march=pentium4 -pipe -fomit-frame-pointer  conftest.c >&5
configure:10071: $? = 0
configure:10078: test -z "$ac_c_werror_flag" || test ! -s conftest.err
configure:10081: $? = 0
configure:10088: test -s conftest.o
configure:10091: $? = 0
configure:10102: result: yes
configure:10106: checking netdb.h presence
configure:10121: gcc -E  conftest.c
configure:10127: $? = 0
configure:10148: result: yes
configure:10176: checking for netdb.h
configure:10184: result: yes
configure:10048: checking netinet/in.h usability
configure:10065: gcc -c -O2 -march=pentium4 -pipe -fomit-frame-pointer  conftest.c >&5
configure:10071: $? = 0
configure:10078: test -z "$ac_c_werror_flag" || test ! -s conftest.err
configure:10081: $? = 0
configure:10088: test -s conftest.o
configure:10091: $? = 0
configure:10102: result: yes
configure:10106: checking netinet/in.h presence
configure:10121: gcc -E  conftest.c
configure:10127: $? = 0
configure:10148: result: yes
configure:10176: checking for netinet/in.h
configure:10184: result: yes
configure:10048: checking stddef.h usability
configure:10065: gcc -c -O2 -march=pentium4 -pipe -fomit-frame-pointer  conftest.c >&5
configure:10071: $? = 0
configure:10078: test -z "$ac_c_werror_flag" || test ! -s conftest.err
configure:10081: $? = 0
configure:10088: test -s conftest.o
configure:10091: $? = 0
configure:10102: result: yes
configure:10106: checking stddef.h presence
configure:10121: gcc -E  conftest.c
configure:10127: $? = 0
configure:10148: result: yes
configure:10176: checking for stddef.h
configure:10184: result: yes
configure:10038: checking for stdint.h
configure:10044: result: yes
configure:10038: checking for stdlib.h
configure:10044: result: yes
configure:10038: checking for string.h
configure:10044: result: yes
configure:10038: checking for strings.h
configure:10044: result: yes
configure:10048: checking sys/file.h usability
configure:10065: gcc -c -O2 -march=pentium4 -pipe -fomit-frame-pointer  conftest.c >&5
configure:10071: $? = 0
configure:10078: test -z "$ac_c_werror_flag" || test ! -s conftest.err
configure:10081: $? = 0
configure:10088: test -s conftest.o
configure:10091: $? = 0
configure:10102: result: yes
configure:10106: checking sys/file.h presence
configure:10121: gcc -E  conftest.c
configure:10127: $? = 0
configure:10148: result: yes
configure:10176: checking for sys/file.h
configure:10184: result: yes
configure:10048: checking sys/ioctl.h usability
configure:10065: gcc -c -O2 -march=pentium4 -pipe -fomit-frame-pointer  conftest.c >&5
configure:10071: $? = 0
configure:10078: test -z "$ac_c_werror_flag" || test ! -s conftest.err
configure:10081: $? = 0
configure:10088: test -s conftest.o
configure:10091: $? = 0
configure:10102: result: yes
configure:10106: checking sys/ioctl.h presence
configure:10121: gcc -E  conftest.c
configure:10127: $? = 0
configure:10148: result: yes
configure:10176: checking for sys/ioctl.h
configure:10184: result: yes
configure:10048: checking sys/param.h usability
configure:10065: gcc -c -O2 -march=pentium4 -pipe -fomit-frame-pointer  conftest.c >&5
configure:10071: $? = 0
configure:10078: test -z "$ac_c_werror_flag" || test ! -s conftest.err
configure:10081: $? = 0
configure:10088: test -s conftest.o
configure:10091: $? = 0
configure:10102: result: yes
configure:10106: checking sys/param.h presence
configure:10121: gcc -E  conftest.c
configure:10127: $? = 0
configure:10148: result: yes
configure:10176: checking for sys/param.h
configure:10184: result: yes
configure:10048: checking sys/socket.h usability
configure:10065: gcc -c -O2 -march=pentium4 -pipe -fomit-frame-pointer  conftest.c >&5
configure:10071: $? = 0
configure:10078: test -z "$ac_c_werror_flag" || test ! -s conftest.err
configure:10081: $? = 0
configure:10088: test -s conftest.o
configure:10091: $? = 0
configure:10102: result: yes
configure:10106: checking sys/socket.h presence
configure:10121: gcc -E  conftest.c
configure:10127: $? = 0
configure:10148: result: yes
configure:10176: checking for sys/socket.h
configure:10184: result: yes
configure:10048: checking sys/time.h usability
configure:10065: gcc -c -O2 -march=pentium4 -pipe -fomit-frame-pointer  conftest.c >&5
configure:10071: $? = 0
configure:10078: test -z "$ac_c_werror_flag" || test ! -s conftest.err
configure:10081: $? = 0
configure:10088: test -s conftest.o
configure:10091: $? = 0
configure:10102: result: yes
configure:10106: checking sys/time.h presence
configure:10121: gcc -E  conftest.c
configure:10127: $? = 0
configure:10148: result: yes
configure:10176: checking for sys/time.h
configure:10184: result: yes
configure:10048: checking syslog.h usability
configure:10065: gcc -c -O2 -march=pentium4 -pipe -fomit-frame-pointer  conftest.c >&5
configure:10071: $? = 0
configure:10078: test -z "$ac_c_werror_flag" || test ! -s conftest.err
configure:10081: $? = 0
configure:10088: test -s conftest.o
configure:10091: $? = 0
configure:10102: result: yes
configure:10106: checking syslog.h presence
configure:10121: gcc -E  conftest.c
configure:10127: $? = 0
configure:10148: result: yes
configure:10176: checking for syslog.h
configure:10184: result: yes
configure:10048: checking termios.h usability
configure:10065: gcc -c -O2 -march=pentium4 -pipe -fomit-frame-pointer  conftest.c >&5
configure:10071: $? = 0
configure:10078: test -z "$ac_c_werror_flag" || test ! -s conftest.err
configure:10081: $? = 0
configure:10088: test -s conftest.o
configure:10091: $? = 0
configure:10102: result: yes
configure:10106: checking termios.h presence
configure:10121: gcc -E  conftest.c
configure:10127: $? = 0
configure:10148: result: yes
configure:10176: checking for termios.h
configure:10184: result: yes
configure:10038: checking for unistd.h
configure:10044: result: yes
configure:10048: checking utime.h usability
configure:10065: gcc -c -O2 -march=pentium4 -pipe -fomit-frame-pointer  conftest.c >&5
configure:10071: $? = 0
configure:10078: test -z "$ac_c_werror_flag" || test ! -s conftest.err
configure:10081: $? = 0
configure:10088: test -s conftest.o
configure:10091: $? = 0
configure:10102: result: yes
configure:10106: checking utime.h presence
configure:10121: gcc -E  conftest.c
configure:10127: $? = 0
configure:10148: result: yes
configure:10176: checking for utime.h
configure:10184: result: yes
configure:10205: checking for special C compiler options needed for large files
configure:10332: result: no
configure:10338: checking for _FILE_OFFSET_BITS value needed for large files
configure:10374: gcc -c -O2 -march=pentium4 -pipe -fomit-frame-pointer  conftest.c >&5
conftest.c:56: warning: left shift count >= width of type
conftest.c:56: warning: left shift count >= width of type
conftest.c:58: error: size of array 'off_t_is_large' is negative
configure:10380: $? = 1
configure: failed program was:
| /* confdefs.h.  */
| #define PACKAGE_NAME ""
| #define PACKAGE_TARNAME ""
| #define PACKAGE_VERSION ""
| #define PACKAGE_STRING ""
| #define PACKAGE_BUGREPORT ""
| #define _GNU_SOURCE 1
| #define STDC_HEADERS 1
| #define HAVE_SYS_TYPES_H 1
| #define HAVE_SYS_STAT_H 1
| #define HAVE_STDLIB_H 1
| #define HAVE_STRING_H 1
| #define HAVE_MEMORY_H 1
| #define HAVE_STRINGS_H 1
| #define HAVE_INTTYPES_H 1
| #define HAVE_STDINT_H 1
| #define HAVE_UNISTD_H 1
| #define __EXTENSIONS__ 1
| #define _POSIX_PTHREAD_SEMANTICS 1
| #define HAVE_PTHREAD 1
| #define HAVE_ALLOCA_H 1
| #define HAVE_ALLOCA 1
| #define HAVE_DIRENT_H 1
| #define STDC_HEADERS 1
| #define HAVE_SYS_WAIT_H 1
| #define HAVE_ARPA_INET_H 1
| #define HAVE_FCNTL_H 1
| #define HAVE_INTTYPES_H 1
| #define HAVE_LIBINTL_H 1
| #define HAVE_LIMITS_H 1
| #define HAVE_LOCALE_H 1
| #define HAVE_MALLOC_H 1
| #define HAVE_NETDB_H 1
| #define HAVE_NETINET_IN_H 1
| #define HAVE_STDDEF_H 1
| #define HAVE_STDINT_H 1
| #define HAVE_STDLIB_H 1
| #define HAVE_STRING_H 1
| #define HAVE_STRINGS_H 1
| #define HAVE_SYS_FILE_H 1
| #define HAVE_SYS_IOCTL_H 1
| #define HAVE_SYS_PARAM_H 1
| #define HAVE_SYS_SOCKET_H 1
| #define HAVE_SYS_TIME_H 1
| #define HAVE_SYSLOG_H 1
| #define HAVE_TERMIOS_H 1
| #define HAVE_UNISTD_H 1
| #define HAVE_UTIME_H 1
| /* end confdefs.h.  */
| #include <sys/types.h>
|  /* Check that off_t can represent 2**63 - 1 correctly.
|     We can't simply define LARGE_OFF_T to be 9223372036854775807,
|     since some C++ compilers masquerading as C compilers
|     incorrectly reject 9223372036854775807.  */
| #define LARGE_OFF_T (((off_t) 1 << 62) - 1 + ((off_t) 1 << 62))
|   int off_t_is_large[(LARGE_OFF_T % 2147483629 == 721
|                      && LARGE_OFF_T % 2147483647 == 1)
|                     ? 1 : -1];
| int
| main ()
| {
|
|   ;
|   return 0;
| }
configure:10441: gcc -c -O2 -march=pentium4 -pipe -fomit-frame-pointer  conftest.c >&5
configure:10447: $? = 0
configure:10454: test -z "$ac_c_werror_flag" || test ! -s conftest.err
configure:10457: $? = 0
configure:10464: test -s conftest.o
configure:10467: $? = 0
configure:10481: result: 64
configure:10491: checking for _LARGE_FILES value needed for large files
configure:10527: gcc -c -O2 -march=pentium4 -pipe -fomit-frame-pointer  conftest.c >&5
configure:10533: $? = 0
configure:10540: test -z "$ac_c_werror_flag" || test ! -s conftest.err
configure:10543: $? = 0
configure:10550: test -s conftest.o
configure:10553: $? = 0
configure:10634: result: no
configure:10648: checking for stdbool.h that conforms to C99
configure:10741: gcc -c -O2 -march=pentium4 -pipe -fomit-frame-pointer  conftest.c >&5
configure:10747: $? = 0
configure:10754: test -z "$ac_c_werror_flag" || test ! -s conftest.err
configure:10757: $? = 0
configure:10764: test -s conftest.o
configure:10767: $? = 0
configure:10779: result: yes
configure:10781: checking for _Bool
configure:10811: gcc -c -O2 -march=pentium4 -pipe -fomit-frame-pointer  conftest.c >&5
configure:10817: $? = 0
configure:10824: test -z "$ac_c_werror_flag" || test ! -s conftest.err
configure:10827: $? = 0
configure:10834: test -s conftest.o
configure:10837: $? = 0
configure:10849: result: yes
configure:10868: checking for an ANSI C-conforming const
configure:10943: gcc -c -O2 -march=pentium4 -pipe -fomit-frame-pointer  conftest.c >&5
configure:10949: $? = 0
configure:10956: test -z "$ac_c_werror_flag" || test ! -s conftest.err
configure:10959: $? = 0
configure:10966: test -s conftest.o
configure:10969: $? = 0
configure:10981: result: yes
configure:10991: checking for uid_t in sys/types.h
configure:11014: result: yes
configure:11029: checking for inline
configure:11055: gcc -c -O2 -march=pentium4 -pipe -fomit-frame-pointer  conftest.c >&5
configure:11061: $? = 0
configure:11068: test -z "$ac_c_werror_flag" || test ! -s conftest.err
configure:11071: $? = 0
configure:11078: test -s conftest.o
configure:11081: $? = 0
configure:11096: result: inline
configure:11115: checking for mode_t
configure:11145: gcc -c -O2 -march=pentium4 -pipe -fomit-frame-pointer  conftest.c >&5
configure:11151: $? = 0
configure:11158: test -z "$ac_c_werror_flag" || test ! -s conftest.err
configure:11161: $? = 0
configure:11168: test -s conftest.o
configure:11171: $? = 0
configure:11183: result: yes
configure:11195: checking for off_t
configure:11225: gcc -c -O2 -march=pentium4 -pipe -fomit-frame-pointer  conftest.c >&5
configure:11231: $? = 0
configure:11238: test -z "$ac_c_werror_flag" || test ! -s conftest.err
configure:11241: $? = 0
configure:11248: test -s conftest.o
configure:11251: $? = 0
configure:11263: result: yes
configure:11275: checking for pid_t
configure:11305: gcc -c -O2 -march=pentium4 -pipe -fomit-frame-pointer  conftest.c >&5
configure:11311: $? = 0
configure:11318: test -z "$ac_c_werror_flag" || test ! -s conftest.err
configure:11321: $? = 0
configure:11328: test -s conftest.o
configure:11331: $? = 0
configure:11343: result: yes
configure:11355: checking for size_t
configure:11385: gcc -c -O2 -march=pentium4 -pipe -fomit-frame-pointer  conftest.c >&5
configure:11391: $? = 0
configure:11398: test -z "$ac_c_werror_flag" || test ! -s conftest.err
configure:11401: $? = 0
configure:11408: test -s conftest.o
configure:11411: $? = 0
configure:11423: result: yes
configure:11435: checking for struct stat.st_blksize
configure:11463: gcc -c -O2 -march=pentium4 -pipe -fomit-frame-pointer  conftest.c >&5
configure:11469: $? = 0
configure:11476: test -z "$ac_c_werror_flag" || test ! -s conftest.err
configure:11479: $? = 0
configure:11486: test -s conftest.o
configure:11489: $? = 0
configure:11560: result: yes
configure:11571: checking whether time.h and sys/time.h may both be included
configure:11601: gcc -c -O2 -march=pentium4 -pipe -fomit-frame-pointer  conftest.c >&5
configure:11607: $? = 0
configure:11614: test -z "$ac_c_werror_flag" || test ! -s conftest.err
configure:11617: $? = 0
configure:11624: test -s conftest.o
configure:11627: $? = 0
configure:11639: result: yes
configure:11649: checking whether struct tm is in sys/time.h or time.h
configure:11677: gcc -c -O2 -march=pentium4 -pipe -fomit-frame-pointer  conftest.c >&5
configure:11683: $? = 0
configure:11690: test -z "$ac_c_werror_flag" || test ! -s conftest.err
configure:11693: $? = 0
configure:11700: test -s conftest.o
configure:11703: $? = 0
configure:11715: result: time.h
configure:11725: checking for working volatile
configure:11754: gcc -c -O2 -march=pentium4 -pipe -fomit-frame-pointer  conftest.c >&5
configure:11760: $? = 0
configure:11767: test -z "$ac_c_werror_flag" || test ! -s conftest.err
configure:11770: $? = 0
configure:11777: test -s conftest.o
configure:11780: $? = 0
configure:11792: result: yes
configure:11802: checking for ptrdiff_t
configure:11832: gcc -c -O2 -march=pentium4 -pipe -fomit-frame-pointer  conftest.c >&5
configure:11838: $? = 0
configure:11845: test -z "$ac_c_werror_flag" || test ! -s conftest.err
configure:11848: $? = 0
configure:11855: test -s conftest.o
configure:11858: $? = 0
configure:11870: result: yes
configure:11888: checking for unistd.h
configure:11894: result: yes
configure:12047: checking for working chown
configure:12090: gcc -o conftest -O2 -march=pentium4 -pipe -fomit-frame-pointer   conftest.c  >&5
configure:12093: $? = 0
configure:12099: ./conftest
configure:12102: $? = 0
configure:12120: result: yes
configure:12130: checking whether closedir returns void
configure:12164: gcc -o conftest -O2 -march=pentium4 -pipe -fomit-frame-pointer   conftest.c  >&5
configure:12167: $? = 0
configure:12173: ./conftest
configure:12176: $? = 0
configure:12192: result: no
configure:12202: checking for error_at_line
configure:12228: gcc -o conftest -O2 -march=pentium4 -pipe -fomit-frame-pointer   conftest.c  >&5
configure:12234: $? = 0
configure:12241: test -z "$ac_c_werror_flag" || test ! -s conftest.err
configure:12244: $? = 0
configure:12251: test -s conftest
configure:12254: $? = 0
configure:12267: result: yes
configure:12293: checking vfork.h usability
configure:12310: gcc -c -O2 -march=pentium4 -pipe -fomit-frame-pointer  conftest.c >&5
conftest.c:91:19: error: vfork.h: No such file or directory
configure:12316: $? = 1
configure: failed program was:
| /* confdefs.h.  */
| #define PACKAGE_NAME ""
| #define PACKAGE_TARNAME ""
| #define PACKAGE_VERSION ""
| #define PACKAGE_STRING ""
| #define PACKAGE_BUGREPORT ""
| #define _GNU_SOURCE 1
| #define STDC_HEADERS 1
| #define HAVE_SYS_TYPES_H 1
| #define HAVE_SYS_STAT_H 1
| #define HAVE_STDLIB_H 1
| #define HAVE_STRING_H 1
| #define HAVE_MEMORY_H 1
| #define HAVE_STRINGS_H 1
| #define HAVE_INTTYPES_H 1
| #define HAVE_STDINT_H 1
| #define HAVE_UNISTD_H 1
| #define __EXTENSIONS__ 1
| #define _POSIX_PTHREAD_SEMANTICS 1
| #define HAVE_PTHREAD 1
| #define HAVE_ALLOCA_H 1
| #define HAVE_ALLOCA 1
| #define HAVE_DIRENT_H 1
| #define STDC_HEADERS 1
| #define HAVE_SYS_WAIT_H 1
| #define HAVE_ARPA_INET_H 1
| #define HAVE_FCNTL_H 1
| #define HAVE_INTTYPES_H 1
| #define HAVE_LIBINTL_H 1
| #define HAVE_LIMITS_H 1
| #define HAVE_LOCALE_H 1
| #define HAVE_MALLOC_H 1
| #define HAVE_NETDB_H 1
| #define HAVE_NETINET_IN_H 1
| #define HAVE_STDDEF_H 1
| #define HAVE_STDINT_H 1
| #define HAVE_STDLIB_H 1
| #define HAVE_STRING_H 1
| #define HAVE_STRINGS_H 1
| #define HAVE_SYS_FILE_H 1
| #define HAVE_SYS_IOCTL_H 1
| #define HAVE_SYS_PARAM_H 1
| #define HAVE_SYS_SOCKET_H 1
| #define HAVE_SYS_TIME_H 1
| #define HAVE_SYSLOG_H 1
| #define HAVE_TERMIOS_H 1
| #define HAVE_UNISTD_H 1
| #define HAVE_UTIME_H 1
| #define _FILE_OFFSET_BITS 64
| #define HAVE__BOOL 1
| #define HAVE_STDBOOL_H 1
| #define HAVE_STRUCT_STAT_ST_BLKSIZE 1
| #define TIME_WITH_SYS_TIME 1
| #define HAVE_PTRDIFF_T 1
| #define HAVE_UNISTD_H 1
| #define HAVE_CHOWN 1
| /* end confdefs.h.  */
| #include <stdio.h>
| #if HAVE_SYS_TYPES_H
| # include <sys/types.h>
| #endif
| #if HAVE_SYS_STAT_H
| # include <sys/stat.h>
| #endif
| #if STDC_HEADERS
| # include <stdlib.h>
| # include <stddef.h>
| #else
| # if HAVE_STDLIB_H
| #  include <stdlib.h>
| # endif
| #endif
| #if HAVE_STRING_H
| # if !STDC_HEADERS && HAVE_MEMORY_H
| #  include <memory.h>
| # endif
| # include <string.h>
| #endif
| #if HAVE_STRINGS_H
| # include <strings.h>
| #endif
| #if HAVE_INTTYPES_H
| # include <inttypes.h>
| #endif
| #if HAVE_STDINT_H
| # include <stdint.h>
| #endif
| #if HAVE_UNISTD_H
| # include <unistd.h>
| #endif
| #include <vfork.h>
configure:12347: result: no
configure:12351: checking vfork.h presence
configure:12366: gcc -E  conftest.c
conftest.c:58:19: error: vfork.h: No such file or directory
configure:12372: $? = 1
configure: failed program was:
| /* confdefs.h.  */
| #define PACKAGE_NAME ""
| #define PACKAGE_TARNAME ""
| #define PACKAGE_VERSION ""
| #define PACKAGE_STRING ""
| #define PACKAGE_BUGREPORT ""
| #define _GNU_SOURCE 1
| #define STDC_HEADERS 1
| #define HAVE_SYS_TYPES_H 1
| #define HAVE_SYS_STAT_H 1
| #define HAVE_STDLIB_H 1
| #define HAVE_STRING_H 1
| #define HAVE_MEMORY_H 1
| #define HAVE_STRINGS_H 1
| #define HAVE_INTTYPES_H 1
| #define HAVE_STDINT_H 1
| #define HAVE_UNISTD_H 1
| #define __EXTENSIONS__ 1
| #define _POSIX_PTHREAD_SEMANTICS 1
| #define HAVE_PTHREAD 1
| #define HAVE_ALLOCA_H 1
| #define HAVE_ALLOCA 1
| #define HAVE_DIRENT_H 1
| #define STDC_HEADERS 1
| #define HAVE_SYS_WAIT_H 1
| #define HAVE_ARPA_INET_H 1
| #define HAVE_FCNTL_H 1
| #define HAVE_INTTYPES_H 1
| #define HAVE_LIBINTL_H 1
| #define HAVE_LIMITS_H 1
| #define HAVE_LOCALE_H 1
| #define HAVE_MALLOC_H 1
| #define HAVE_NETDB_H 1
| #define HAVE_NETINET_IN_H 1
| #define HAVE_STDDEF_H 1
| #define HAVE_STDINT_H 1
| #define HAVE_STDLIB_H 1
| #define HAVE_STRING_H 1
| #define HAVE_STRINGS_H 1
| #define HAVE_SYS_FILE_H 1
| #define HAVE_SYS_IOCTL_H 1
| #define HAVE_SYS_PARAM_H 1
| #define HAVE_SYS_SOCKET_H 1
| #define HAVE_SYS_TIME_H 1
| #define HAVE_SYSLOG_H 1
| #define HAVE_TERMIOS_H 1
| #define HAVE_UNISTD_H 1
| #define HAVE_UTIME_H 1
| #define _FILE_OFFSET_BITS 64
| #define HAVE__BOOL 1
| #define HAVE_STDBOOL_H 1
| #define HAVE_STRUCT_STAT_ST_BLKSIZE 1
| #define TIME_WITH_SYS_TIME 1
| #define HAVE_PTRDIFF_T 1
| #define HAVE_UNISTD_H 1
| #define HAVE_CHOWN 1
| /* end confdefs.h.  */
| #include <vfork.h>
configure:12393: result: no
configure:12421: checking for vfork.h
configure:12429: result: no
configure:12447: checking for fork
configure:12503: gcc -o conftest -O2 -march=pentium4 -pipe -fomit-frame-pointer   conftest.c  >&5
conftest.c:81: warning: conflicting types for built-in function 'fork'
configure:12509: $? = 0
configure:12516: test -z "$ac_c_werror_flag" || test ! -s conftest.err
configure:12519: $? = 0
configure:12526: test -s conftest
configure:12529: $? = 0
configure:12543: result: yes
configure:12447: checking for vfork
configure:12503: gcc -o conftest -O2 -march=pentium4 -pipe -fomit-frame-pointer   conftest.c  >&5
configure:12509: $? = 0
configure:12516: test -z "$ac_c_werror_flag" || test ! -s conftest.err
configure:12519: $? = 0
configure:12526: test -s conftest
configure:12529: $? = 0
configure:12543: result: yes
configure:12554: checking for working fork
configure:12586: gcc -o conftest -O2 -march=pentium4 -pipe -fomit-frame-pointer   conftest.c  >&5
configure:12589: $? = 0
configure:12595: ./conftest
configure:12598: $? = 0
configure:12614: result: yes
configure:12635: checking for working vfork
configure:12773: result: yes
configure:12804: checking for _LARGEFILE_SOURCE value needed for large files
configure:12832: gcc -c -O2 -march=pentium4 -pipe -fomit-frame-pointer  conftest.c >&5
conftest.c: In function 'main':
conftest.c:66: warning: the address of 'fseeko', will always evaluate as 'true'
configure:12838: $? = 0
configure:12845: test -z "$ac_c_werror_flag" || test ! -s conftest.err
configure:12848: $? = 0
configure:12855: test -s conftest.o
configure:12858: $? = 0
configure:12931: result: no
configure:12945: checking for fseeko
configure:12971: gcc -o conftest -O2 -march=pentium4 -pipe -fomit-frame-pointer   conftest.c  >&5
conftest.c: In function 'main':
conftest.c:66: warning: the address of 'fseeko', will always evaluate as 'true'
configure:12977: $? = 0
configure:12984: test -z "$ac_c_werror_flag" || test ! -s conftest.err
configure:12987: $? = 0
configure:12994: test -s conftest
configure:12997: $? = 0
configure:13010: result: yes
configure:13021: checking whether gcc needs -traditional
configure:13063: result: no
configure:13074: checking for working memcmp
configure:13127: gcc -o conftest -O2 -march=pentium4 -pipe -fomit-frame-pointer   conftest.c  >&5
configure:13130: $? = 0
configure:13136: ./conftest
configure:13139: $? = 0
configure:13155: result: yes
configure:13171: checking for stdlib.h
configure:13177: result: yes
configure:13171: checking for sys/time.h
configure:13177: result: yes
configure:13171: checking for unistd.h
configure:13177: result: yes
configure:13334: checking for alarm
configure:13390: gcc -o conftest -O2 -march=pentium4 -pipe -fomit-frame-pointer   conftest.c  >&5
configure:13396: $? = 0
configure:13403: test -z "$ac_c_werror_flag" || test ! -s conftest.err
configure:13406: $? = 0
configure:13413: test -s conftest
configure:13416: $? = 0
configure:13430: result: yes
configure:13440: checking for working mktime
configure:13621: gcc -o conftest -O2 -march=pentium4 -pipe -fomit-frame-pointer   conftest.c  >&5
configure:13624: $? = 0
configure:13630: ./conftest
configure:13633: $? = 0
configure:13649: result: yes
configure:13666: checking for stdlib.h
configure:13672: result: yes
configure:13666: checking for unistd.h
configure:13672: result: yes
configure:13829: checking for getpagesize
configure:13885: gcc -o conftest -O2 -march=pentium4 -pipe -fomit-frame-pointer   conftest.c  >&5
configure:13891: $? = 0
configure:13898: test -z "$ac_c_werror_flag" || test ! -s conftest.err
configure:13901: $? = 0
configure:13908: test -s conftest
configure:13911: $? = 0
configure:13925: result: yes
configure:13935: checking for working mmap
configure:14082: gcc -o conftest -O2 -march=pentium4 -pipe -fomit-frame-pointer   conftest.c  >&5
configure:14085: $? = 0
configure:14091: ./conftest
configure:14094: $? = 0
configure:14110: result: yes
configure:14137: checking sys/select.h usability
configure:14154: gcc -c -O2 -march=pentium4 -pipe -fomit-frame-pointer  conftest.c >&5
configure:14160: $? = 0
configure:14167: test -z "$ac_c_werror_flag" || test ! -s conftest.err
configure:14170: $? = 0
configure:14177: test -s conftest.o
configure:14180: $? = 0
configure:14191: result: yes
configure:14195: checking sys/select.h presence
configure:14210: gcc -E  conftest.c
configure:14216: $? = 0
configure:14237: result: yes
configure:14265: checking for sys/select.h
configure:14273: result: yes
configure:14127: checking for sys/socket.h
configure:14133: result: yes
configure:14286: checking types of arguments for select
configure:14324: gcc -c -O2 -march=pentium4 -pipe -fomit-frame-pointer  conftest.c >&5
configure:14330: $? = 0
configure:14337: test -z "$ac_c_werror_flag" || test ! -s conftest.err
configure:14340: $? = 0
configure:14347: test -s conftest.o
configure:14350: $? = 0
configure:14368: result: int,fd_set *,struct timeval *
configure:14391: checking for function prototypes
configure:14394: result: yes
configure:14411: checking whether setvbuf arguments are reversed
configure:14441: gcc -o conftest -O2 -march=pentium4 -pipe -fomit-frame-pointer   conftest.c  >&5
conftest.c:80: error: conflicting types for 'setvbuf'
/usr/include/stdio.h:306: error: previous declaration of 'setvbuf' was here
configure:14447: $? = 1
configure: failed program was:
| /* confdefs.h.  */
| #define PACKAGE_NAME ""
| #define PACKAGE_TARNAME ""
| #define PACKAGE_VERSION ""
| #define PACKAGE_STRING ""
| #define PACKAGE_BUGREPORT ""
| #define _GNU_SOURCE 1
| #define STDC_HEADERS 1
| #define HAVE_SYS_TYPES_H 1
| #define HAVE_SYS_STAT_H 1
| #define HAVE_STDLIB_H 1
| #define HAVE_STRING_H 1
| #define HAVE_MEMORY_H 1
| #define HAVE_STRINGS_H 1
| #define HAVE_INTTYPES_H 1
| #define HAVE_STDINT_H 1
| #define HAVE_UNISTD_H 1
| #define __EXTENSIONS__ 1
| #define _POSIX_PTHREAD_SEMANTICS 1
| #define HAVE_PTHREAD 1
| #define HAVE_ALLOCA_H 1
| #define HAVE_ALLOCA 1
| #define HAVE_DIRENT_H 1
| #define STDC_HEADERS 1
| #define HAVE_SYS_WAIT_H 1
| #define HAVE_ARPA_INET_H 1
| #define HAVE_FCNTL_H 1
| #define HAVE_INTTYPES_H 1
| #define HAVE_LIBINTL_H 1
| #define HAVE_LIMITS_H 1
| #define HAVE_LOCALE_H 1
| #define HAVE_MALLOC_H 1
| #define HAVE_NETDB_H 1
| #define HAVE_NETINET_IN_H 1
| #define HAVE_STDDEF_H 1
| #define HAVE_STDINT_H 1
| #define HAVE_STDLIB_H 1
| #define HAVE_STRING_H 1
| #define HAVE_STRINGS_H 1
| #define HAVE_SYS_FILE_H 1
| #define HAVE_SYS_IOCTL_H 1
| #define HAVE_SYS_PARAM_H 1
| #define HAVE_SYS_SOCKET_H 1
| #define HAVE_SYS_TIME_H 1
| #define HAVE_SYSLOG_H 1
| #define HAVE_TERMIOS_H 1
| #define HAVE_UNISTD_H 1
| #define HAVE_UTIME_H 1
| #define _FILE_OFFSET_BITS 64
| #define HAVE__BOOL 1
| #define HAVE_STDBOOL_H 1
| #define HAVE_STRUCT_STAT_ST_BLKSIZE 1
| #define TIME_WITH_SYS_TIME 1
| #define HAVE_PTRDIFF_T 1
| #define HAVE_UNISTD_H 1
| #define HAVE_CHOWN 1
| #define HAVE_FORK 1
| #define HAVE_VFORK 1
| #define HAVE_WORKING_VFORK 1
| #define HAVE_WORKING_FORK 1
| #define HAVE_FSEEKO 1
| #define HAVE_STDLIB_H 1
| #define HAVE_SYS_TIME_H 1
| #define HAVE_UNISTD_H 1
| #define HAVE_ALARM 1
| #define HAVE_STDLIB_H 1
| #define HAVE_UNISTD_H 1
| #define HAVE_GETPAGESIZE 1
| #define HAVE_MMAP 1
| #define HAVE_SYS_SELECT_H 1
| #define HAVE_SYS_SOCKET_H 1
| #define SELECT_TYPE_ARG1 int
| #define SELECT_TYPE_ARG234 (fd_set *)
| #define SELECT_TYPE_ARG5 (struct timeval *)
| #define PROTOTYPES 1
| #define __PROTOTYPES 1
| /* end confdefs.h.  */
| #include <stdio.h>
| #       if PROTOTYPES
|          int (setvbuf) (FILE *, int, char *, size_t);
| #       endif
| int
| main ()
| {
| char buf; return setvbuf (stdout, _IOLBF, &buf, 1);
|   ;
|   return 0;
| }
configure:14600: result: no
configure:14610: checking return type of signal handlers
configure:14638: gcc -c -O2 -march=pentium4 -pipe -fomit-frame-pointer  conftest.c >&5
conftest.c: In function 'main':
conftest.c:84: error: void value not ignored as it ought to be
configure:14644: $? = 1
configure: failed program was:
| /* confdefs.h.  */
| #define PACKAGE_NAME ""
| #define PACKAGE_TARNAME ""
| #define PACKAGE_VERSION ""
| #define PACKAGE_STRING ""
| #define PACKAGE_BUGREPORT ""
| #define _GNU_SOURCE 1
| #define STDC_HEADERS 1
| #define HAVE_SYS_TYPES_H 1
| #define HAVE_SYS_STAT_H 1
| #define HAVE_STDLIB_H 1
| #define HAVE_STRING_H 1
| #define HAVE_MEMORY_H 1
| #define HAVE_STRINGS_H 1
| #define HAVE_INTTYPES_H 1
| #define HAVE_STDINT_H 1
| #define HAVE_UNISTD_H 1
| #define __EXTENSIONS__ 1
| #define _POSIX_PTHREAD_SEMANTICS 1
| #define HAVE_PTHREAD 1
| #define HAVE_ALLOCA_H 1
| #define HAVE_ALLOCA 1
| #define HAVE_DIRENT_H 1
| #define STDC_HEADERS 1
| #define HAVE_SYS_WAIT_H 1
| #define HAVE_ARPA_INET_H 1
| #define HAVE_FCNTL_H 1
| #define HAVE_INTTYPES_H 1
| #define HAVE_LIBINTL_H 1
| #define HAVE_LIMITS_H 1
| #define HAVE_LOCALE_H 1
| #define HAVE_MALLOC_H 1
| #define HAVE_NETDB_H 1
| #define HAVE_NETINET_IN_H 1
| #define HAVE_STDDEF_H 1
| #define HAVE_STDINT_H 1
| #define HAVE_STDLIB_H 1
| #define HAVE_STRING_H 1
| #define HAVE_STRINGS_H 1
| #define HAVE_SYS_FILE_H 1
| #define HAVE_SYS_IOCTL_H 1
| #define HAVE_SYS_PARAM_H 1
| #define HAVE_SYS_SOCKET_H 1
| #define HAVE_SYS_TIME_H 1
| #define HAVE_SYSLOG_H 1
| #define HAVE_TERMIOS_H 1
| #define HAVE_UNISTD_H 1
| #define HAVE_UTIME_H 1
| #define _FILE_OFFSET_BITS 64
| #define HAVE__BOOL 1
| #define HAVE_STDBOOL_H 1
| #define HAVE_STRUCT_STAT_ST_BLKSIZE 1
| #define TIME_WITH_SYS_TIME 1
| #define HAVE_PTRDIFF_T 1
| #define HAVE_UNISTD_H 1
| #define HAVE_CHOWN 1
| #define HAVE_FORK 1
| #define HAVE_VFORK 1
| #define HAVE_WORKING_VFORK 1
| #define HAVE_WORKING_FORK 1
| #define HAVE_FSEEKO 1
| #define HAVE_STDLIB_H 1
| #define HAVE_SYS_TIME_H 1
| #define HAVE_UNISTD_H 1
| #define HAVE_ALARM 1
| #define HAVE_STDLIB_H 1
| #define HAVE_UNISTD_H 1
| #define HAVE_GETPAGESIZE 1
| #define HAVE_MMAP 1
| #define HAVE_SYS_SELECT_H 1
| #define HAVE_SYS_SOCKET_H 1
| #define SELECT_TYPE_ARG1 int
| #define SELECT_TYPE_ARG234 (fd_set *)
| #define SELECT_TYPE_ARG5 (struct timeval *)
| #define PROTOTYPES 1
| #define __PROTOTYPES 1
| /* end confdefs.h.  */
| #include <sys/types.h>
| #include <signal.h>
|
| int
| main ()
| {
| return *(signal (0, 0)) (0) == 1;
|   ;
|   return 0;
| }
configure:14676: result: void
configure:14684: checking whether lstat dereferences a symlink specified with a trailing slash
configure:14720: gcc -o conftest -O2 -march=pentium4 -pipe -fomit-frame-pointer   conftest.c  >&5
configure:14723: $? = 0
configure:14729: ./conftest
configure:14732: $? = 0
configure:14755: result: yes
configure:14774: checking whether stat accepts an empty string
configure:14804: gcc -o conftest -O2 -march=pentium4 -pipe -fomit-frame-pointer   conftest.c  >&5
configure:14807: $? = 0
configure:14813: ./conftest
configure:14816: $? = 0
configure:14832: result: no
configure:14848: checking for working strcoll
configure:14879: gcc -o conftest -O2 -march=pentium4 -pipe -fomit-frame-pointer   conftest.c  >&5
configure:14882: $? = 0
configure:14888: ./conftest
configure:14891: $? = 0
configure:14907: result: yes
configure:14921: checking for strftime
configure:14977: gcc -o conftest -O2 -march=pentium4 -pipe -fomit-frame-pointer   conftest.c  >&5
conftest.c:104: warning: conflicting types for built-in function 'strftime'
configure:14983: $? = 0
configure:14990: test -z "$ac_c_werror_flag" || test ! -s conftest.err
configure:14993: $? = 0
configure:15000: test -s conftest
configure:15003: $? = 0
configure:15017: result: yes
configure:15114: checking for working strnlen
configure:15158: gcc -o conftest -O2 -march=pentium4 -pipe -fomit-frame-pointer   conftest.c  >&5
configure:15161: $? = 0
configure:15167: ./conftest
configure:15170: $? = 0
configure:15186: result: yes
configure:15195: checking for working strtod
configure:15246: gcc -o conftest -O2 -march=pentium4 -pipe -fomit-frame-pointer   conftest.c  >&5
configure:15249: $? = 0
configure:15255: ./conftest
configure:15258: $? = 0
configure:15274: result: yes
configure:15470: checking whether utime accepts a null argument
configure:15506: gcc -o conftest -O2 -march=pentium4 -pipe -fomit-frame-pointer   conftest.c  >&5
configure:15509: $? = 0
configure:15515: ./conftest
configure:15518: $? = 0
configure:15534: result: yes
configure:15549: checking for vprintf
configure:15605: gcc -o conftest -O2 -march=pentium4 -pipe -fomit-frame-pointer   conftest.c  >&5
conftest.c:106: warning: conflicting types for built-in function 'vprintf'
configure:15611: $? = 0
configure:15618: test -z "$ac_c_werror_flag" || test ! -s conftest.err
configure:15621: $? = 0
configure:15628: test -s conftest
configure:15631: $? = 0
configure:15645: result: yes
configure:15652: checking for _doprnt
configure:15708: gcc -o conftest -O2 -march=pentium4 -pipe -fomit-frame-pointer   conftest.c  >&5
/tmp/cc044dHa.o: In function `main':
conftest.c:(.text+0xf): undefined reference to `_doprnt'
collect2: ld returned 1 exit status
configure:15714: $? = 1
configure: failed program was:
| /* confdefs.h.  */
| #define PACKAGE_NAME ""
| #define PACKAGE_TARNAME ""
| #define PACKAGE_VERSION ""
| #define PACKAGE_STRING ""
| #define PACKAGE_BUGREPORT ""
| #define _GNU_SOURCE 1
| #define STDC_HEADERS 1
| #define HAVE_SYS_TYPES_H 1
| #define HAVE_SYS_STAT_H 1
| #define HAVE_STDLIB_H 1
| #define HAVE_STRING_H 1
| #define HAVE_MEMORY_H 1
| #define HAVE_STRINGS_H 1
| #define HAVE_INTTYPES_H 1
| #define HAVE_STDINT_H 1
| #define HAVE_UNISTD_H 1
| #define __EXTENSIONS__ 1
| #define _POSIX_PTHREAD_SEMANTICS 1
| #define HAVE_PTHREAD 1
| #define HAVE_ALLOCA_H 1
| #define HAVE_ALLOCA 1
| #define HAVE_DIRENT_H 1
| #define STDC_HEADERS 1
| #define HAVE_SYS_WAIT_H 1
| #define HAVE_ARPA_INET_H 1
| #define HAVE_FCNTL_H 1
| #define HAVE_INTTYPES_H 1
| #define HAVE_LIBINTL_H 1
| #define HAVE_LIMITS_H 1
| #define HAVE_LOCALE_H 1
| #define HAVE_MALLOC_H 1
| #define HAVE_NETDB_H 1
| #define HAVE_NETINET_IN_H 1
| #define HAVE_STDDEF_H 1
| #define HAVE_STDINT_H 1
| #define HAVE_STDLIB_H 1
| #define HAVE_STRING_H 1
| #define HAVE_STRINGS_H 1
| #define HAVE_SYS_FILE_H 1
| #define HAVE_SYS_IOCTL_H 1
| #define HAVE_SYS_PARAM_H 1
| #define HAVE_SYS_SOCKET_H 1
| #define HAVE_SYS_TIME_H 1
| #define HAVE_SYSLOG_H 1
| #define HAVE_TERMIOS_H 1
| #define HAVE_UNISTD_H 1
| #define HAVE_UTIME_H 1
| #define _FILE_OFFSET_BITS 64
| #define HAVE__BOOL 1
| #define HAVE_STDBOOL_H 1
| #define HAVE_STRUCT_STAT_ST_BLKSIZE 1
| #define TIME_WITH_SYS_TIME 1
| #define HAVE_PTRDIFF_T 1
| #define HAVE_UNISTD_H 1
| #define HAVE_CHOWN 1
| #define HAVE_FORK 1
| #define HAVE_VFORK 1
| #define HAVE_WORKING_VFORK 1
| #define HAVE_WORKING_FORK 1
| #define HAVE_FSEEKO 1
| #define HAVE_STDLIB_H 1
| #define HAVE_SYS_TIME_H 1
| #define HAVE_UNISTD_H 1
| #define HAVE_ALARM 1
| #define HAVE_STDLIB_H 1
| #define HAVE_UNISTD_H 1
| #define HAVE_GETPAGESIZE 1
| #define HAVE_MMAP 1
| #define HAVE_SYS_SELECT_H 1
| #define HAVE_SYS_SOCKET_H 1
| #define SELECT_TYPE_ARG1 int
| #define SELECT_TYPE_ARG234 (fd_set *)
| #define SELECT_TYPE_ARG5 (struct timeval *)
| #define PROTOTYPES 1
| #define __PROTOTYPES 1
| #define RETSIGTYPE void
| #define LSTAT_FOLLOWS_SLASHED_SYMLINK 1
| #define HAVE_STRCOLL 1
| #define HAVE_STRFTIME 1
| #define HAVE_UTIME_NULL 1
| #define HAVE_VPRINTF 1
| /* end confdefs.h.  */
| /* Define _doprnt to an innocuous variant, in case <limits.h> declares _doprnt.
|    For example, HP-UX 11i <limits.h> declares gettimeofday.  */
| #define _doprnt innocuous__doprnt
|
| /* System header to define __stub macros and hopefully few prototypes,
|     which can conflict with char _doprnt (); below.
|     Prefer <limits.h> to <assert.h> if __STDC__ is defined, since
|     <limits.h> exists even on freestanding compilers.  */
|
| #ifdef __STDC__
| # include <limits.h>
| #else
| # include <assert.h>
| #endif
|
| #undef _doprnt
|
| /* Override any GCC internal prototype to avoid an error.
|    Use char because int might match the return type of a GCC
|    builtin and then its argument prototype would still apply.  */
| #ifdef __cplusplus
| extern "C"
| #endif
| char _doprnt ();
| /* The GNU C library defines this for functions which it implements
|     to always fail with ENOSYS.  Some functions are actually named
|     something starting with __ and the normal name is an alias.  */
| #if defined __stub__doprnt || defined __stub____doprnt
| choke me
| #endif
|
| int
| main ()
| {
| return _doprnt ();
|   ;
|   return 0;
| }
configure:15747: result: no
configure:15811: checking for asprintf
configure:15867: gcc -o conftest -O2 -march=pentium4 -pipe -fomit-frame-pointer   conftest.c  >&5
configure:15873: $? = 0
configure:15880: test -z "$ac_c_werror_flag" || test ! -s conftest.err
configure:15883: $? = 0
configure:15890: test -s conftest
configure:15893: $? = 0
configure:15907: result: yes
configure:15811: checking for atexit
configure:15867: gcc -o conftest -O2 -march=pentium4 -pipe -fomit-frame-pointer   conftest.c  >&5
configure:15873: $? = 0
configure:15880: test -z "$ac_c_werror_flag" || test ! -s conftest.err
configure:15883: $? = 0
configure:15890: test -s conftest
configure:15893: $? = 0
configure:15907: result: yes
configure:15811: checking for bzero
configure:15867: gcc -o conftest -O2 -march=pentium4 -pipe -fomit-frame-pointer   conftest.c  >&5
conftest.c:109: warning: conflicting types for built-in function 'bzero'
configure:15873: $? = 0
configure:15880: test -z "$ac_c_werror_flag" || test ! -s conftest.err
configure:15883: $? = 0
configure:15890: test -s conftest
configure:15893: $? = 0
configure:15907: result: yes
configure:15811: checking for dup2
configure:15867: gcc -o conftest -O2 -march=pentium4 -pipe -fomit-frame-pointer   conftest.c  >&5
configure:15873: $? = 0
configure:15880: test -z "$ac_c_werror_flag" || test ! -s conftest.err
configure:15883: $? = 0
configure:15890: test -s conftest
configure:15893: $? = 0
configure:15907: result: yes
configure:15811: checking for endpwent
configure:15867: gcc -o conftest -O2 -march=pentium4 -pipe -fomit-frame-pointer   conftest.c  >&5
configure:15873: $? = 0
configure:15880: test -z "$ac_c_werror_flag" || test ! -s conftest.err
configure:15883: $? = 0
configure:15890: test -s conftest
configure:15893: $? = 0
configure:15907: result: yes
configure:15811: checking for floor
configure:15867: gcc -o conftest -O2 -march=pentium4 -pipe -fomit-frame-pointer   conftest.c  >&5
conftest.c:112: warning: conflicting types for built-in function 'floor'
/tmp/ccq345na.o: In function `main':
conftest.c:(.text+0xf): undefined reference to `floor'
collect2: ld returned 1 exit status
configure:15873: $? = 1
configure: failed program was:
| /* confdefs.h.  */
| #define PACKAGE_NAME ""
| #define PACKAGE_TARNAME ""
| #define PACKAGE_VERSION ""
| #define PACKAGE_STRING ""
| #define PACKAGE_BUGREPORT ""
| #define _GNU_SOURCE 1
| #define STDC_HEADERS 1
| #define HAVE_SYS_TYPES_H 1
| #define HAVE_SYS_STAT_H 1
| #define HAVE_STDLIB_H 1
| #define HAVE_STRING_H 1
| #define HAVE_MEMORY_H 1
| #define HAVE_STRINGS_H 1
| #define HAVE_INTTYPES_H 1
| #define HAVE_STDINT_H 1
| #define HAVE_UNISTD_H 1
| #define __EXTENSIONS__ 1
| #define _POSIX_PTHREAD_SEMANTICS 1
| #define HAVE_PTHREAD 1
| #define HAVE_ALLOCA_H 1
| #define HAVE_ALLOCA 1
| #define HAVE_DIRENT_H 1
| #define STDC_HEADERS 1
| #define HAVE_SYS_WAIT_H 1
| #define HAVE_ARPA_INET_H 1
| #define HAVE_FCNTL_H 1
| #define HAVE_INTTYPES_H 1
| #define HAVE_LIBINTL_H 1
| #define HAVE_LIMITS_H 1
| #define HAVE_LOCALE_H 1
| #define HAVE_MALLOC_H 1
| #define HAVE_NETDB_H 1
| #define HAVE_NETINET_IN_H 1
| #define HAVE_STDDEF_H 1
| #define HAVE_STDINT_H 1
| #define HAVE_STDLIB_H 1
| #define HAVE_STRING_H 1
| #define HAVE_STRINGS_H 1
| #define HAVE_SYS_FILE_H 1
| #define HAVE_SYS_IOCTL_H 1
| #define HAVE_SYS_PARAM_H 1
| #define HAVE_SYS_SOCKET_H 1
| #define HAVE_SYS_TIME_H 1
| #define HAVE_SYSLOG_H 1
| #define HAVE_TERMIOS_H 1
| #define HAVE_UNISTD_H 1
| #define HAVE_UTIME_H 1
| #define _FILE_OFFSET_BITS 64
| #define HAVE__BOOL 1
| #define HAVE_STDBOOL_H 1
| #define HAVE_STRUCT_STAT_ST_BLKSIZE 1
| #define TIME_WITH_SYS_TIME 1
| #define HAVE_PTRDIFF_T 1
| #define HAVE_UNISTD_H 1
| #define HAVE_CHOWN 1
| #define HAVE_FORK 1
| #define HAVE_VFORK 1
| #define HAVE_WORKING_VFORK 1
| #define HAVE_WORKING_FORK 1
| #define HAVE_FSEEKO 1
| #define HAVE_STDLIB_H 1
| #define HAVE_SYS_TIME_H 1
| #define HAVE_UNISTD_H 1
| #define HAVE_ALARM 1
| #define HAVE_STDLIB_H 1
| #define HAVE_UNISTD_H 1
| #define HAVE_GETPAGESIZE 1
| #define HAVE_MMAP 1
| #define HAVE_SYS_SELECT_H 1
| #define HAVE_SYS_SOCKET_H 1
| #define SELECT_TYPE_ARG1 int
| #define SELECT_TYPE_ARG234 (fd_set *)
| #define SELECT_TYPE_ARG5 (struct timeval *)
| #define PROTOTYPES 1
| #define __PROTOTYPES 1
| #define RETSIGTYPE void
| #define LSTAT_FOLLOWS_SLASHED_SYMLINK 1
| #define HAVE_STRCOLL 1
| #define HAVE_STRFTIME 1
| #define HAVE_UTIME_NULL 1
| #define HAVE_VPRINTF 1
| #define HAVE_ASPRINTF 1
| #define HAVE_ATEXIT 1
| #define HAVE_BZERO 1
| #define HAVE_DUP2 1
| #define HAVE_ENDPWENT 1
| /* end confdefs.h.  */
| /* Define floor to an innocuous variant, in case <limits.h> declares floor.
|    For example, HP-UX 11i <limits.h> declares gettimeofday.  */
| #define floor innocuous_floor
|
| /* System header to define __stub macros and hopefully few prototypes,
|     which can conflict with char floor (); below.
|     Prefer <limits.h> to <assert.h> if __STDC__ is defined, since
|     <limits.h> exists even on freestanding compilers.  */
|
| #ifdef __STDC__
| # include <limits.h>
| #else
| # include <assert.h>
| #endif
|
| #undef floor
|
| /* Override any GCC internal prototype to avoid an error.
|    Use char because int might match the return type of a GCC
|    builtin and then its argument prototype would still apply.  */
| #ifdef __cplusplus
| extern "C"
| #endif
| char floor ();
| /* The GNU C library defines this for functions which it implements
|     to always fail with ENOSYS.  Some functions are actually named
|     something starting with __ and the normal name is an alias.  */
| #if defined __stub_floor || defined __stub___floor
| choke me
| #endif
|
| int
| main ()
| {
| return floor ();
|   ;
|   return 0;
| }
configure:15907: result: no
configure:15811: checking for ftruncate
configure:15867: gcc -o conftest -O2 -march=pentium4 -pipe -fomit-frame-pointer   conftest.c  >&5
configure:15873: $? = 0
configure:15880: test -z "$ac_c_werror_flag" || test ! -s conftest.err
configure:15883: $? = 0
configure:15890: test -s conftest
configure:15893: $? = 0
configure:15907: result: yes
configure:15811: checking for getcwd
configure:15867: gcc -o conftest -O2 -march=pentium4 -pipe -fomit-frame-pointer   conftest.c  >&5
configure:15873: $? = 0
configure:15880: test -z "$ac_c_werror_flag" || test ! -s conftest.err
configure:15883: $? = 0
configure:15890: test -s conftest
configure:15893: $? = 0
configure:15907: result: yes
configure:15811: checking for gethostbyname
configure:15867: gcc -o conftest -O2 -march=pentium4 -pipe -fomit-frame-pointer   conftest.c  >&5
configure:15873: $? = 0
configure:15880: test -z "$ac_c_werror_flag" || test ! -s conftest.err
configure:15883: $? = 0
configure:15890: test -s conftest
configure:15893: $? = 0
configure:15907: result: yes
configure:15811: checking for gethostname
configure:15867: gcc -o conftest -O2 -march=pentium4 -pipe -fomit-frame-pointer   conftest.c  >&5
configure:15873: $? = 0
configure:15880: test -z "$ac_c_werror_flag" || test ! -s conftest.err
configure:15883: $? = 0
configure:15890: test -s conftest
configure:15893: $? = 0
configure:15907: result: yes
configure:15811: checking for getloadavg
configure:15867: gcc -o conftest -O2 -march=pentium4 -pipe -fomit-frame-pointer   conftest.c  >&5
configure:15873: $? = 0
configure:15880: test -z "$ac_c_werror_flag" || test ! -s conftest.err
configure:15883: $? = 0
configure:15890: test -s conftest
configure:15893: $? = 0
configure:15907: result: yes
configure:15811: checking for gettimeofday
configure:15867: gcc -o conftest -O2 -march=pentium4 -pipe -fomit-frame-pointer   conftest.c  >&5
configure:15873: $? = 0
configure:15880: test -z "$ac_c_werror_flag" || test ! -s conftest.err
configure:15883: $? = 0
configure:15890: test -s conftest
configure:15893: $? = 0
configure:15907: result: yes
configure:15811: checking for inet_ntoa
configure:15867: gcc -o conftest -O2 -march=pentium4 -pipe -fomit-frame-pointer   conftest.c  >&5
configure:15873: $? = 0
configure:15880: test -z "$ac_c_werror_flag" || test ! -s conftest.err
configure:15883: $? = 0
configure:15890: test -s conftest
configure:15893: $? = 0
configure:15907: result: yes
configure:15811: checking for isascii
configure:15867: gcc -o conftest -O2 -march=pentium4 -pipe -fomit-frame-pointer   conftest.c  >&5
conftest.c:119: warning: conflicting types for built-in function 'isascii'
configure:15873: $? = 0
configure:15880: test -z "$ac_c_werror_flag" || test ! -s conftest.err
configure:15883: $? = 0
configure:15890: test -s conftest
configure:15893: $? = 0
configure:15907: result: yes
configure:15811: checking for localtime_r
configure:15867: gcc -o conftest -O2 -march=pentium4 -pipe -fomit-frame-pointer   conftest.c  >&5
configure:15873: $? = 0
configure:15880: test -z "$ac_c_werror_flag" || test ! -s conftest.err
configure:15883: $? = 0
configure:15890: test -s conftest
configure:15893: $? = 0
configure:15907: result: yes
configure:15811: checking for memchr
configure:15867: gcc -o conftest -O2 -march=pentium4 -pipe -fomit-frame-pointer   conftest.c  >&5
configure:15873: $? = 0
configure:15880: test -z "$ac_c_werror_flag" || test ! -s conftest.err
configure:15883: $? = 0
configure:15890: test -s conftest
configure:15893: $? = 0
configure:15907: result: yes
configure:15811: checking for memmove
configure:15867: gcc -o conftest -O2 -march=pentium4 -pipe -fomit-frame-pointer   conftest.c  >&5
conftest.c:122: warning: conflicting types for built-in function 'memmove'
configure:15873: $? = 0
configure:15880: test -z "$ac_c_werror_flag" || test ! -s conftest.err
configure:15883: $? = 0
configure:15890: test -s conftest
configure:15893: $? = 0
configure:15907: result: yes
configure:15811: checking for memset
configure:15867: gcc -o conftest -O2 -march=pentium4 -pipe -fomit-frame-pointer   conftest.c  >&5
conftest.c:123: warning: conflicting types for built-in function 'memset'
configure:15873: $? = 0
configure:15880: test -z "$ac_c_werror_flag" || test ! -s conftest.err
configure:15883: $? = 0
configure:15890: test -s conftest
configure:15893: $? = 0
configure:15907: result: yes
configure:15811: checking for mkdir
configure:15867: gcc -o conftest -O2 -march=pentium4 -pipe -fomit-frame-pointer   conftest.c  >&5
configure:15873: $? = 0
configure:15880: test -z "$ac_c_werror_flag" || test ! -s conftest.err
configure:15883: $? = 0
configure:15890: test -s conftest
configure:15893: $? = 0
configure:15907: result: yes
configure:15811: checking for munmap
configure:15867: gcc -o conftest -O2 -march=pentium4 -pipe -fomit-frame-pointer   conftest.c  >&5
configure:15873: $? = 0
configure:15880: test -z "$ac_c_werror_flag" || test ! -s conftest.err
configure:15883: $? = 0
configure:15890: test -s conftest
configure:15893: $? = 0
configure:15907: result: yes
configure:15811: checking for pow
configure:15867: gcc -o conftest -O2 -march=pentium4 -pipe -fomit-frame-pointer   conftest.c  >&5
conftest.c:126: warning: conflicting types for built-in function 'pow'
/tmp/ccfJbf0y.o: In function `main':
conftest.c:(.text+0xf): undefined reference to `pow'
collect2: ld returned 1 exit status
configure:15873: $? = 1
configure: failed program was:
| /* confdefs.h.  */
| #define PACKAGE_NAME ""
| #define PACKAGE_TARNAME ""
| #define PACKAGE_VERSION ""
| #define PACKAGE_STRING ""
| #define PACKAGE_BUGREPORT ""
| #define _GNU_SOURCE 1
| #define STDC_HEADERS 1
| #define HAVE_SYS_TYPES_H 1
| #define HAVE_SYS_STAT_H 1
| #define HAVE_STDLIB_H 1
| #define HAVE_STRING_H 1
| #define HAVE_MEMORY_H 1
| #define HAVE_STRINGS_H 1
| #define HAVE_INTTYPES_H 1
| #define HAVE_STDINT_H 1
| #define HAVE_UNISTD_H 1
| #define __EXTENSIONS__ 1
| #define _POSIX_PTHREAD_SEMANTICS 1
| #define HAVE_PTHREAD 1
| #define HAVE_ALLOCA_H 1
| #define HAVE_ALLOCA 1
| #define HAVE_DIRENT_H 1
| #define STDC_HEADERS 1
| #define HAVE_SYS_WAIT_H 1
| #define HAVE_ARPA_INET_H 1
| #define HAVE_FCNTL_H 1
| #define HAVE_INTTYPES_H 1
| #define HAVE_LIBINTL_H 1
| #define HAVE_LIMITS_H 1
| #define HAVE_LOCALE_H 1
| #define HAVE_MALLOC_H 1
| #define HAVE_NETDB_H 1
| #define HAVE_NETINET_IN_H 1
| #define HAVE_STDDEF_H 1
| #define HAVE_STDINT_H 1
| #define HAVE_STDLIB_H 1
| #define HAVE_STRING_H 1
| #define HAVE_STRINGS_H 1
| #define HAVE_SYS_FILE_H 1
| #define HAVE_SYS_IOCTL_H 1
| #define HAVE_SYS_PARAM_H 1
| #define HAVE_SYS_SOCKET_H 1
| #define HAVE_SYS_TIME_H 1
| #define HAVE_SYSLOG_H 1
| #define HAVE_TERMIOS_H 1
| #define HAVE_UNISTD_H 1
| #define HAVE_UTIME_H 1
| #define _FILE_OFFSET_BITS 64
| #define HAVE__BOOL 1
| #define HAVE_STDBOOL_H 1
| #define HAVE_STRUCT_STAT_ST_BLKSIZE 1
| #define TIME_WITH_SYS_TIME 1
| #define HAVE_PTRDIFF_T 1
| #define HAVE_UNISTD_H 1
| #define HAVE_CHOWN 1
| #define HAVE_FORK 1
| #define HAVE_VFORK 1
| #define HAVE_WORKING_VFORK 1
| #define HAVE_WORKING_FORK 1
| #define HAVE_FSEEKO 1
| #define HAVE_STDLIB_H 1
| #define HAVE_SYS_TIME_H 1
| #define HAVE_UNISTD_H 1
| #define HAVE_ALARM 1
| #define HAVE_STDLIB_H 1
| #define HAVE_UNISTD_H 1
| #define HAVE_GETPAGESIZE 1
| #define HAVE_MMAP 1
| #define HAVE_SYS_SELECT_H 1
| #define HAVE_SYS_SOCKET_H 1
| #define SELECT_TYPE_ARG1 int
| #define SELECT_TYPE_ARG234 (fd_set *)
| #define SELECT_TYPE_ARG5 (struct timeval *)
| #define PROTOTYPES 1
| #define __PROTOTYPES 1
| #define RETSIGTYPE void
| #define LSTAT_FOLLOWS_SLASHED_SYMLINK 1
| #define HAVE_STRCOLL 1
| #define HAVE_STRFTIME 1
| #define HAVE_UTIME_NULL 1
| #define HAVE_VPRINTF 1
| #define HAVE_ASPRINTF 1
| #define HAVE_ATEXIT 1
| #define HAVE_BZERO 1
| #define HAVE_DUP2 1
| #define HAVE_ENDPWENT 1
| #define HAVE_FTRUNCATE 1
| #define HAVE_GETCWD 1
| #define HAVE_GETHOSTBYNAME 1
| #define HAVE_GETHOSTNAME 1
| #define HAVE_GETLOADAVG 1
| #define HAVE_GETTIMEOFDAY 1
| #define HAVE_INET_NTOA 1
| #define HAVE_ISASCII 1
| #define HAVE_LOCALTIME_R 1
| #define HAVE_MEMCHR 1
| #define HAVE_MEMMOVE 1
| #define HAVE_MEMSET 1
| #define HAVE_MKDIR 1
| #define HAVE_MUNMAP 1
| /* end confdefs.h.  */
| /* Define pow to an innocuous variant, in case <limits.h> declares pow.
|    For example, HP-UX 11i <limits.h> declares gettimeofday.  */
| #define pow innocuous_pow
|
| /* System header to define __stub macros and hopefully few prototypes,
|     which can conflict with char pow (); below.
|     Prefer <limits.h> to <assert.h> if __STDC__ is defined, since
|     <limits.h> exists even on freestanding compilers.  */
|
| #ifdef __STDC__
| # include <limits.h>
| #else
| # include <assert.h>
| #endif
|
| #undef pow
|
| /* Override any GCC internal prototype to avoid an error.
|    Use char because int might match the return type of a GCC
|    builtin and then its argument prototype would still apply.  */
| #ifdef __cplusplus
| extern "C"
| #endif
| char pow ();
| /* The GNU C library defines this for functions which it implements
|     to always fail with ENOSYS.  Some functions are actually named
|     something starting with __ and the normal name is an alias.  */
| #if defined __stub_pow || defined __stub___pow
| choke me
| #endif
|
| int
| main ()
| {
| return pow ();
|   ;
|   return 0;
| }
configure:15907: result: no
configure:15811: checking for putenv
configure:15867: gcc -o conftest -O2 -march=pentium4 -pipe -fomit-frame-pointer   conftest.c  >&5
configure:15873: $? = 0
configure:15880: test -z "$ac_c_werror_flag" || test ! -s conftest.err
configure:15883: $? = 0
configure:15890: test -s conftest
configure:15893: $? = 0
configure:15907: result: yes
configure:15811: checking for re_comp
configure:15867: gcc -o conftest -O2 -march=pentium4 -pipe -fomit-frame-pointer   conftest.c  >&5
configure:15873: $? = 0
configure:15880: test -z "$ac_c_werror_flag" || test ! -s conftest.err
configure:15883: $? = 0
configure:15890: test -s conftest
configure:15893: $? = 0
configure:15907: result: yes
configure:15811: checking for regcomp
configure:15867: gcc -o conftest -O2 -march=pentium4 -pipe -fomit-frame-pointer   conftest.c  >&5
configure:15873: $? = 0
configure:15880: test -z "$ac_c_werror_flag" || test ! -s conftest.err
configure:15883: $? = 0
configure:15890: test -s conftest
configure:15893: $? = 0
configure:15907: result: yes
configure:15811: checking for rint
configure:15867: gcc -o conftest -O2 -march=pentium4 -pipe -fomit-frame-pointer   conftest.c  >&5
conftest.c:129: warning: conflicting types for built-in function 'rint'
/tmp/cczE0Pje.o: In function `main':
conftest.c:(.text+0xf): undefined reference to `rint'
collect2: ld returned 1 exit status
configure:15873: $? = 1
configure: failed program was:
| /* confdefs.h.  */
| #define PACKAGE_NAME ""
| #define PACKAGE_TARNAME ""
| #define PACKAGE_VERSION ""
| #define PACKAGE_STRING ""
| #define PACKAGE_BUGREPORT ""
| #define _GNU_SOURCE 1
| #define STDC_HEADERS 1
| #define HAVE_SYS_TYPES_H 1
| #define HAVE_SYS_STAT_H 1
| #define HAVE_STDLIB_H 1
| #define HAVE_STRING_H 1
| #define HAVE_MEMORY_H 1
| #define HAVE_STRINGS_H 1
| #define HAVE_INTTYPES_H 1
| #define HAVE_STDINT_H 1
| #define HAVE_UNISTD_H 1
| #define __EXTENSIONS__ 1
| #define _POSIX_PTHREAD_SEMANTICS 1
| #define HAVE_PTHREAD 1
| #define HAVE_ALLOCA_H 1
| #define HAVE_ALLOCA 1
| #define HAVE_DIRENT_H 1
| #define STDC_HEADERS 1
| #define HAVE_SYS_WAIT_H 1
| #define HAVE_ARPA_INET_H 1
| #define HAVE_FCNTL_H 1
| #define HAVE_INTTYPES_H 1
| #define HAVE_LIBINTL_H 1
| #define HAVE_LIMITS_H 1
| #define HAVE_LOCALE_H 1
| #define HAVE_MALLOC_H 1
| #define HAVE_NETDB_H 1
| #define HAVE_NETINET_IN_H 1
| #define HAVE_STDDEF_H 1
| #define HAVE_STDINT_H 1
| #define HAVE_STDLIB_H 1
| #define HAVE_STRING_H 1
| #define HAVE_STRINGS_H 1
| #define HAVE_SYS_FILE_H 1
| #define HAVE_SYS_IOCTL_H 1
| #define HAVE_SYS_PARAM_H 1
| #define HAVE_SYS_SOCKET_H 1
| #define HAVE_SYS_TIME_H 1
| #define HAVE_SYSLOG_H 1
| #define HAVE_TERMIOS_H 1
| #define HAVE_UNISTD_H 1
| #define HAVE_UTIME_H 1
| #define _FILE_OFFSET_BITS 64
| #define HAVE__BOOL 1
| #define HAVE_STDBOOL_H 1
| #define HAVE_STRUCT_STAT_ST_BLKSIZE 1
| #define TIME_WITH_SYS_TIME 1
| #define HAVE_PTRDIFF_T 1
| #define HAVE_UNISTD_H 1
| #define HAVE_CHOWN 1
| #define HAVE_FORK 1
| #define HAVE_VFORK 1
| #define HAVE_WORKING_VFORK 1
| #define HAVE_WORKING_FORK 1
| #define HAVE_FSEEKO 1
| #define HAVE_STDLIB_H 1
| #define HAVE_SYS_TIME_H 1
| #define HAVE_UNISTD_H 1
| #define HAVE_ALARM 1
| #define HAVE_STDLIB_H 1
| #define HAVE_UNISTD_H 1
| #define HAVE_GETPAGESIZE 1
| #define HAVE_MMAP 1
| #define HAVE_SYS_SELECT_H 1
| #define HAVE_SYS_SOCKET_H 1
| #define SELECT_TYPE_ARG1 int
| #define SELECT_TYPE_ARG234 (fd_set *)
| #define SELECT_TYPE_ARG5 (struct timeval *)
| #define PROTOTYPES 1
| #define __PROTOTYPES 1
| #define RETSIGTYPE void
| #define LSTAT_FOLLOWS_SLASHED_SYMLINK 1
| #define HAVE_STRCOLL 1
| #define HAVE_STRFTIME 1
| #define HAVE_UTIME_NULL 1
| #define HAVE_VPRINTF 1
| #define HAVE_ASPRINTF 1
| #define HAVE_ATEXIT 1
| #define HAVE_BZERO 1
| #define HAVE_DUP2 1
| #define HAVE_ENDPWENT 1
| #define HAVE_FTRUNCATE 1
| #define HAVE_GETCWD 1
| #define HAVE_GETHOSTBYNAME 1
| #define HAVE_GETHOSTNAME 1
| #define HAVE_GETLOADAVG 1
| #define HAVE_GETTIMEOFDAY 1
| #define HAVE_INET_NTOA 1
| #define HAVE_ISASCII 1
| #define HAVE_LOCALTIME_R 1
| #define HAVE_MEMCHR 1
| #define HAVE_MEMMOVE 1
| #define HAVE_MEMSET 1
| #define HAVE_MKDIR 1
| #define HAVE_MUNMAP 1
| #define HAVE_PUTENV 1
| #define HAVE_RE_COMP 1
| #define HAVE_REGCOMP 1
| /* end confdefs.h.  */
| /* Define rint to an innocuous variant, in case <limits.h> declares rint.
|    For example, HP-UX 11i <limits.h> declares gettimeofday.  */
| #define rint innocuous_rint
|
| /* System header to define __stub macros and hopefully few prototypes,
|     which can conflict with char rint (); below.
|     Prefer <limits.h> to <assert.h> if __STDC__ is defined, since
|     <limits.h> exists even on freestanding compilers.  */
|
| #ifdef __STDC__
| # include <limits.h>
| #else
| # include <assert.h>
| #endif
|
| #undef rint
|
| /* Override any GCC internal prototype to avoid an error.
|    Use char because int might match the return type of a GCC
|    builtin and then its argument prototype would still apply.  */
| #ifdef __cplusplus
| extern "C"
| #endif
| char rint ();
| /* The GNU C library defines this for functions which it implements
|     to always fail with ENOSYS.  Some functions are actually named
|     something starting with __ and the normal name is an alias.  */
| #if defined __stub_rint || defined __stub___rint
| choke me
| #endif
|
| int
| main ()
| {
| return rint ();
|   ;
|   return 0;
| }
configure:15907: result: no
configure:15811: checking for select
configure:15867: gcc -o conftest -O2 -march=pentium4 -pipe -fomit-frame-pointer   conftest.c  >&5
configure:15873: $? = 0
configure:15880: test -z "$ac_c_werror_flag" || test ! -s conftest.err
configure:15883: $? = 0
configure:15890: test -s conftest
configure:15893: $? = 0
configure:15907: result: yes
configure:15811: checking for setenv
configure:15867: gcc -o conftest -O2 -march=pentium4 -pipe -fomit-frame-pointer   conftest.c  >&5
configure:15873: $? = 0
configure:15880: test -z "$ac_c_werror_flag" || test ! -s conftest.err
configure:15883: $? = 0
configure:15890: test -s conftest
configure:15893: $? = 0
configure:15907: result: yes
configure:15811: checking for socket
configure:15867: gcc -o conftest -O2 -march=pentium4 -pipe -fomit-frame-pointer   conftest.c  >&5
configure:15873: $? = 0
configure:15880: test -z "$ac_c_werror_flag" || test ! -s conftest.err
configure:15883: $? = 0
configure:15890: test -s conftest
configure:15893: $? = 0
configure:15907: result: yes
configure:15811: checking for sqrt
configure:15867: gcc -o conftest -O2 -march=pentium4 -pipe -fomit-frame-pointer   conftest.c  >&5
conftest.c:132: warning: conflicting types for built-in function 'sqrt'
/tmp/ccpBujoN.o: In function `main':
conftest.c:(.text+0xf): undefined reference to `sqrt'
collect2: ld returned 1 exit status
configure:15873: $? = 1
configure: failed program was:
| /* confdefs.h.  */
| #define PACKAGE_NAME ""
| #define PACKAGE_TARNAME ""
| #define PACKAGE_VERSION ""
| #define PACKAGE_STRING ""
| #define PACKAGE_BUGREPORT ""
| #define _GNU_SOURCE 1
| #define STDC_HEADERS 1
| #define HAVE_SYS_TYPES_H 1
| #define HAVE_SYS_STAT_H 1
| #define HAVE_STDLIB_H 1
| #define HAVE_STRING_H 1
| #define HAVE_MEMORY_H 1
| #define HAVE_STRINGS_H 1
| #define HAVE_INTTYPES_H 1
| #define HAVE_STDINT_H 1
| #define HAVE_UNISTD_H 1
| #define __EXTENSIONS__ 1
| #define _POSIX_PTHREAD_SEMANTICS 1
| #define HAVE_PTHREAD 1
| #define HAVE_ALLOCA_H 1
| #define HAVE_ALLOCA 1
| #define HAVE_DIRENT_H 1
| #define STDC_HEADERS 1
| #define HAVE_SYS_WAIT_H 1
| #define HAVE_ARPA_INET_H 1
| #define HAVE_FCNTL_H 1
| #define HAVE_INTTYPES_H 1
| #define HAVE_LIBINTL_H 1
| #define HAVE_LIMITS_H 1
| #define HAVE_LOCALE_H 1
| #define HAVE_MALLOC_H 1
| #define HAVE_NETDB_H 1
| #define HAVE_NETINET_IN_H 1
| #define HAVE_STDDEF_H 1
| #define HAVE_STDINT_H 1
| #define HAVE_STDLIB_H 1
| #define HAVE_STRING_H 1
| #define HAVE_STRINGS_H 1
| #define HAVE_SYS_FILE_H 1
| #define HAVE_SYS_IOCTL_H 1
| #define HAVE_SYS_PARAM_H 1
| #define HAVE_SYS_SOCKET_H 1
| #define HAVE_SYS_TIME_H 1
| #define HAVE_SYSLOG_H 1
| #define HAVE_TERMIOS_H 1
| #define HAVE_UNISTD_H 1
| #define HAVE_UTIME_H 1
| #define _FILE_OFFSET_BITS 64
| #define HAVE__BOOL 1
| #define HAVE_STDBOOL_H 1
| #define HAVE_STRUCT_STAT_ST_BLKSIZE 1
| #define TIME_WITH_SYS_TIME 1
| #define HAVE_PTRDIFF_T 1
| #define HAVE_UNISTD_H 1
| #define HAVE_CHOWN 1
| #define HAVE_FORK 1
| #define HAVE_VFORK 1
| #define HAVE_WORKING_VFORK 1
| #define HAVE_WORKING_FORK 1
| #define HAVE_FSEEKO 1
| #define HAVE_STDLIB_H 1
| #define HAVE_SYS_TIME_H 1
| #define HAVE_UNISTD_H 1
| #define HAVE_ALARM 1
| #define HAVE_STDLIB_H 1
| #define HAVE_UNISTD_H 1
| #define HAVE_GETPAGESIZE 1
| #define HAVE_MMAP 1
| #define HAVE_SYS_SELECT_H 1
| #define HAVE_SYS_SOCKET_H 1
| #define SELECT_TYPE_ARG1 int
| #define SELECT_TYPE_ARG234 (fd_set *)
| #define SELECT_TYPE_ARG5 (struct timeval *)
| #define PROTOTYPES 1
| #define __PROTOTYPES 1
| #define RETSIGTYPE void
| #define LSTAT_FOLLOWS_SLASHED_SYMLINK 1
| #define HAVE_STRCOLL 1
| #define HAVE_STRFTIME 1
| #define HAVE_UTIME_NULL 1
| #define HAVE_VPRINTF 1
| #define HAVE_ASPRINTF 1
| #define HAVE_ATEXIT 1
| #define HAVE_BZERO 1
| #define HAVE_DUP2 1
| #define HAVE_ENDPWENT 1
| #define HAVE_FTRUNCATE 1
| #define HAVE_GETCWD 1
| #define HAVE_GETHOSTBYNAME 1
| #define HAVE_GETHOSTNAME 1
| #define HAVE_GETLOADAVG 1
| #define HAVE_GETTIMEOFDAY 1
| #define HAVE_INET_NTOA 1
| #define HAVE_ISASCII 1
| #define HAVE_LOCALTIME_R 1
| #define HAVE_MEMCHR 1
| #define HAVE_MEMMOVE 1
| #define HAVE_MEMSET 1
| #define HAVE_MKDIR 1
| #define HAVE_MUNMAP 1
| #define HAVE_PUTENV 1
| #define HAVE_RE_COMP 1
| #define HAVE_REGCOMP 1
| #define HAVE_SELECT 1
| #define HAVE_SETENV 1
| #define HAVE_SOCKET 1
| /* end confdefs.h.  */
| /* Define sqrt to an innocuous variant, in case <limits.h> declares sqrt.
|    For example, HP-UX 11i <limits.h> declares gettimeofday.  */
| #define sqrt innocuous_sqrt
|
| /* System header to define __stub macros and hopefully few prototypes,
|     which can conflict with char sqrt (); below.
|     Prefer <limits.h> to <assert.h> if __STDC__ is defined, since
|     <limits.h> exists even on freestanding compilers.  */
|
| #ifdef __STDC__
| # include <limits.h>
| #else
| # include <assert.h>
| #endif
|
| #undef sqrt
|
| /* Override any GCC internal prototype to avoid an error.
|    Use char because int might match the return type of a GCC
|    builtin and then its argument prototype would still apply.  */
| #ifdef __cplusplus
| extern "C"
| #endif
| char sqrt ();
| /* The GNU C library defines this for functions which it implements
|     to always fail with ENOSYS.  Some functions are actually named
|     something starting with __ and the normal name is an alias.  */
| #if defined __stub_sqrt || defined __stub___sqrt
| choke me
| #endif
|
| int
| main ()
| {
| return sqrt ();
|   ;
|   return 0;
| }
configure:15907: result: no
configure:15811: checking for strcasecmp
configure:15867: gcc -o conftest -O2 -march=pentium4 -pipe -fomit-frame-pointer   conftest.c  >&5
conftest.c:132: warning: conflicting types for built-in function 'strcasecmp'
configure:15873: $? = 0
configure:15880: test -z "$ac_c_werror_flag" || test ! -s conftest.err
configure:15883: $? = 0
configure:15890: test -s conftest
configure:15893: $? = 0
configure:15907: result: yes
configure:15811: checking for strcasestr
configure:15867: gcc -o conftest -O2 -march=pentium4 -pipe -fomit-frame-pointer   conftest.c  >&5
configure:15873: $? = 0
configure:15880: test -z "$ac_c_werror_flag" || test ! -s conftest.err
configure:15883: $? = 0
configure:15890: test -s conftest
configure:15893: $? = 0
configure:15907: result: yes
configure:15811: checking for strchr
configure:15867: gcc -o conftest -O2 -march=pentium4 -pipe -fomit-frame-pointer   conftest.c  >&5
conftest.c:134: warning: conflicting types for built-in function 'strchr'
configure:15873: $? = 0
configure:15880: test -z "$ac_c_werror_flag" || test ! -s conftest.err
configure:15883: $? = 0
configure:15890: test -s conftest
configure:15893: $? = 0
configure:15907: result: yes
configure:15811: checking for strcspn
configure:15867: gcc -o conftest -O2 -march=pentium4 -pipe -fomit-frame-pointer   conftest.c  >&5
conftest.c:135: warning: conflicting types for built-in function 'strcspn'
configure:15873: $? = 0
configure:15880: test -z "$ac_c_werror_flag" || test ! -s conftest.err
configure:15883: $? = 0
configure:15890: test -s conftest
configure:15893: $? = 0
configure:15907: result: yes
configure:15811: checking for strdup
configure:15867: gcc -o conftest -O2 -march=pentium4 -pipe -fomit-frame-pointer   conftest.c  >&5
conftest.c:136: warning: conflicting types for built-in function 'strdup'
configure:15873: $? = 0
configure:15880: test -z "$ac_c_werror_flag" || test ! -s conftest.err
configure:15883: $? = 0
configure:15890: test -s conftest
configure:15893: $? = 0
configure:15907: result: yes
configure:15811: checking for strerror
configure:15867: gcc -o conftest -O2 -march=pentium4 -pipe -fomit-frame-pointer   conftest.c  >&5
configure:15873: $? = 0
configure:15880: test -z "$ac_c_werror_flag" || test ! -s conftest.err
configure:15883: $? = 0
configure:15890: test -s conftest
configure:15893: $? = 0
configure:15907: result: yes
configure:15811: checking for strncasecmp
configure:15867: gcc -o conftest -O2 -march=pentium4 -pipe -fomit-frame-pointer   conftest.c  >&5
conftest.c:138: warning: conflicting types for built-in function 'strncasecmp'
configure:15873: $? = 0
configure:15880: test -z "$ac_c_werror_flag" || test ! -s conftest.err
configure:15883: $? = 0
configure:15890: test -s conftest
configure:15893: $? = 0
configure:15907: result: yes
configure:15811: checking for strndup
configure:15867: gcc -o conftest -O2 -march=pentium4 -pipe -fomit-frame-pointer   conftest.c  >&5
conftest.c:139: warning: conflicting types for built-in function 'strndup'
configure:15873: $? = 0
configure:15880: test -z "$ac_c_werror_flag" || test ! -s conftest.err
configure:15883: $? = 0
configure:15890: test -s conftest
configure:15893: $? = 0
configure:15907: result: yes
configure:15811: checking for strnlen
configure:15867: gcc -o conftest -O2 -march=pentium4 -pipe -fomit-frame-pointer   conftest.c  >&5
configure:15873: $? = 0
configure:15880: test -z "$ac_c_werror_flag" || test ! -s conftest.err
configure:15883: $? = 0
configure:15890: test -s conftest
configure:15893: $? = 0
configure:15907: result: yes
configure:15811: checking for strrchr
configure:15867: gcc -o conftest -O2 -march=pentium4 -pipe -fomit-frame-pointer   conftest.c  >&5
conftest.c:141: warning: conflicting types for built-in function 'strrchr'
configure:15873: $? = 0
configure:15880: test -z "$ac_c_werror_flag" || test ! -s conftest.err
configure:15883: $? = 0
configure:15890: test -s conftest
configure:15893: $? = 0
configure:15907: result: yes
configure:15811: checking for strsep
configure:15867: gcc -o conftest -O2 -march=pentium4 -pipe -fomit-frame-pointer   conftest.c  >&5
configure:15873: $? = 0
configure:15880: test -z "$ac_c_werror_flag" || test ! -s conftest.err
configure:15883: $? = 0
configure:15890: test -s conftest
configure:15893: $? = 0
configure:15907: result: yes
configure:15811: checking for strspn
configure:15867: gcc -o conftest -O2 -march=pentium4 -pipe -fomit-frame-pointer   conftest.c  >&5
conftest.c:143: warning: conflicting types for built-in function 'strspn'
configure:15873: $? = 0
configure:15880: test -z "$ac_c_werror_flag" || test ! -s conftest.err
configure:15883: $? = 0
configure:15890: test -s conftest
configure:15893: $? = 0
configure:15907: result: yes
configure:15811: checking for strstr
configure:15867: gcc -o conftest -O2 -march=pentium4 -pipe -fomit-frame-pointer   conftest.c  >&5
conftest.c:144: warning: conflicting types for built-in function 'strstr'
configure:15873: $? = 0
configure:15880: test -z "$ac_c_werror_flag" || test ! -s conftest.err
configure:15883: $? = 0
configure:15890: test -s conftest
configure:15893: $? = 0
configure:15907: result: yes
configure:15811: checking for strtol
configure:15867: gcc -o conftest -O2 -march=pentium4 -pipe -fomit-frame-pointer   conftest.c  >&5
configure:15873: $? = 0
configure:15880: test -z "$ac_c_werror_flag" || test ! -s conftest.err
configure:15883: $? = 0
configure:15890: test -s conftest
configure:15893: $? = 0
configure:15907: result: yes
configure:15811: checking for strtoq
configure:15867: gcc -o conftest -O2 -march=pentium4 -pipe -fomit-frame-pointer   conftest.c  >&5
configure:15873: $? = 0
configure:15880: test -z "$ac_c_werror_flag" || test ! -s conftest.err
configure:15883: $? = 0
configure:15890: test -s conftest
configure:15893: $? = 0
configure:15907: result: yes
configure:15811: checking for unsetenv
configure:15867: gcc -o conftest -O2 -march=pentium4 -pipe -fomit-frame-pointer   conftest.c  >&5
configure:15873: $? = 0
configure:15880: test -z "$ac_c_werror_flag" || test ! -s conftest.err
configure:15883: $? = 0
configure:15890: test -s conftest
configure:15893: $? = 0
configure:15907: result: yes
configure:15811: checking for utime
configure:15867: gcc -o conftest -O2 -march=pentium4 -pipe -fomit-frame-pointer   conftest.c  >&5
configure:15873: $? = 0
configure:15880: test -z "$ac_c_werror_flag" || test ! -s conftest.err
configure:15883: $? = 0
configure:15890: test -s conftest
configure:15893: $? = 0
configure:15907: result: yes
configure:15811: checking for vasprintf
configure:15867: gcc -o conftest -O2 -march=pentium4 -pipe -fomit-frame-pointer   conftest.c  >&5
configure:15873: $? = 0
configure:15880: test -z "$ac_c_werror_flag" || test ! -s conftest.err
configure:15883: $? = 0
configure:15890: test -s conftest
configure:15893: $? = 0
configure:15907: result: yes
configure:15918: checking for PTHREAD_RWLOCK_INITIALIZER
configure:15941: gcc -o conftest -O2 -march=pentium4 -pipe -fomit-frame-pointer   conftest.c  >&5
conftest.c: In function 'main':
conftest.c:131: warning: braces around scalar initializer
conftest.c:131: warning: (near initialization for 'foo')
conftest.c:131: warning: excess elements in scalar initializer
conftest.c:131: warning: (near initialization for 'foo')
conftest.c:131: warning: excess elements in scalar initializer
conftest.c:131: warning: (near initialization for 'foo')
conftest.c:131: warning: excess elements in scalar initializer
conftest.c:131: warning: (near initialization for 'foo')
conftest.c:131: warning: excess elements in scalar initializer
conftest.c:131: warning: (near initialization for 'foo')
conftest.c:131: warning: excess elements in scalar initializer
conftest.c:131: warning: (near initialization for 'foo')
conftest.c:131: warning: excess elements in scalar initializer
conftest.c:131: warning: (near initialization for 'foo')
conftest.c:131: warning: excess elements in scalar initializer
conftest.c:131: warning: (near initialization for 'foo')
configure:15947: $? = 0
configure:15954: test -z "$ac_c_werror_flag" || test ! -s conftest.err
configure:15957: $? = 0
configure:15964: test -s conftest
configure:15967: $? = 0
configure:15969: result: yes
configure:15988: checking for PTHREAD_RWLOCK_PREFER_WRITER_NP
configure:16011: gcc -o conftest -O2 -march=pentium4 -pipe -fomit-frame-pointer   conftest.c  >&5
configure:16017: $? = 0
configure:16024: test -z "$ac_c_werror_flag" || test ! -s conftest.err
configure:16027: $? = 0
configure:16034: test -s conftest
configure:16037: $? = 0
configure:16039: result: yes
configure:16058: checking for compiler atomic operations
configure:16081: gcc -o conftest -O2 -march=pentium4 -pipe -fomit-frame-pointer   conftest.c  >&5
configure:16087: $? = 0
configure:16094: test -z "$ac_c_werror_flag" || test ! -s conftest.err
configure:16097: $? = 0
configure:16104: test -s conftest
configure:16107: $? = 0
configure:16109: result: yes
configure:16129: checking for compiler 'attribute pure' support
configure:16152: gcc -c -O2 -march=pentium4 -pipe -fomit-frame-pointer  conftest.c >&5
configure:16158: $? = 0
configure:16165: test -z "$ac_c_werror_flag" || test ! -s conftest.err
configure:16168: $? = 0
configure:16175: test -s conftest.o
configure:16178: $? = 0
configure:16180: result: yes
configure:16198: checking for compiler 'attribute malloc' support
configure:16221: gcc -c -O2 -march=pentium4 -pipe -fomit-frame-pointer  conftest.c >&5
conftest.c:131: warning: 'malloc' attribute ignored
configure:16227: $? = 0
configure:16234: test -z "$ac_c_werror_flag" || test ! -s conftest.err
configure:16237: $? = 0
configure:16244: test -s conftest.o
configure:16247: $? = 0
configure:16249: result: yes
configure:16267: checking for compiler 'attribute const' support
configure:16290: gcc -c -O2 -march=pentium4 -pipe -fomit-frame-pointer  conftest.c >&5
configure:16296: $? = 0
configure:16303: test -z "$ac_c_werror_flag" || test ! -s conftest.err
configure:16306: $? = 0
configure:16313: test -s conftest.o
configure:16316: $? = 0
configure:16318: result: yes
configure:16336: checking for compiler 'attribute unused' support
configure:16359: gcc -c -O2 -march=pentium4 -pipe -fomit-frame-pointer  conftest.c >&5
configure:16365: $? = 0
configure:16372: test -z "$ac_c_werror_flag" || test ! -s conftest.err
configure:16375: $? = 0
configure:16382: test -s conftest.o
configure:16385: $? = 0
configure:16387: result: yes
configure:16405: checking for compiler 'attribute always_inline' support
configure:16428: gcc -c -O2 -march=pentium4 -pipe -fomit-frame-pointer  conftest.c >&5
configure:16434: $? = 0
configure:16441: test -z "$ac_c_werror_flag" || test ! -s conftest.err
configure:16444: $? = 0
configure:16451: test -s conftest.o
configure:16454: $? = 0
configure:16456: result: yes
configure:16474: checking for -ffunction-sections support
configure:16499: gcc -c -O2 -march=pentium4 -pipe -fomit-frame-pointer -ffunction-sections  conftest.c >&5
configure:16505: $? = 0
configure:16512: test -z "$ac_c_werror_flag" || test ! -s conftest.err
configure:16515: $? = 0
configure:16522: test -s conftest.o
configure:16525: $? = 0
configure:16527: result: yes
configure:16531: checking for --gc-sections support
configure:16554: gcc -o conftest -O2 -march=pentium4 -pipe -fomit-frame-pointer -ffunction-sections   -Wl,--gc-sections conftest.c  >&5
configure:16560: $? = 0
configure:16567: test -z "$ac_c_werror_flag" || test ! -s conftest.err
configure:16570: $? = 0
configure:16577: test -s conftest
configure:16580: $? = 0
configure:16582: result: yes
configure:16612: checking for res_ninit
configure:16635: gcc -o conftest -O2 -march=pentium4 -pipe -fomit-frame-pointer   conftest.c  >&5
configure:16641: $? = 0
configure:16648: test -z "$ac_c_werror_flag" || test ! -s conftest.err
configure:16651: $? = 0
configure:16658: test -s conftest
configure:16661: $? = 0
configure:16663: result: yes
configure:16682: checking for RTLD_NOLOAD
configure:16705: gcc -o conftest -O2 -march=pentium4 -pipe -fomit-frame-pointer   conftest.c  >&5
configure:16711: $? = 0
configure:16718: test -z "$ac_c_werror_flag" || test ! -s conftest.err
configure:16721: $? = 0
configure:16728: test -s conftest
configure:16731: $? = 0
configure:16733: result: yes
configure:16752: checking for IP_MTU_DISCOVER
configure:16775: gcc -o conftest -O2 -march=pentium4 -pipe -fomit-frame-pointer   conftest.c  >&5
configure:16781: $? = 0
configure:16788: test -z "$ac_c_werror_flag" || test ! -s conftest.err
configure:16791: $? = 0
configure:16798: test -s conftest
configure:16801: $? = 0
configure:16803: result: yes
configure:16832: checking libkern/OSAtomic.h usability
configure:16849: gcc -c -O2 -march=pentium4 -pipe -fomit-frame-pointer  conftest.c >&5
conftest.c:171:30: error: libkern/OSAtomic.h: No such file or directory
configure:16855: $? = 1
configure: failed program was:
| /* confdefs.h.  */
| #define PACKAGE_NAME ""
| #define PACKAGE_TARNAME ""
| #define PACKAGE_VERSION ""
| #define PACKAGE_STRING ""
| #define PACKAGE_BUGREPORT ""
| #define _GNU_SOURCE 1
| #define STDC_HEADERS 1
| #define HAVE_SYS_TYPES_H 1
| #define HAVE_SYS_STAT_H 1
| #define HAVE_STDLIB_H 1
| #define HAVE_STRING_H 1
| #define HAVE_MEMORY_H 1
| #define HAVE_STRINGS_H 1
| #define HAVE_INTTYPES_H 1
| #define HAVE_STDINT_H 1
| #define HAVE_UNISTD_H 1
| #define __EXTENSIONS__ 1
| #define _POSIX_PTHREAD_SEMANTICS 1
| #define HAVE_PTHREAD 1
| #define HAVE_ALLOCA_H 1
| #define HAVE_ALLOCA 1
| #define HAVE_DIRENT_H 1
| #define STDC_HEADERS 1
| #define HAVE_SYS_WAIT_H 1
| #define HAVE_ARPA_INET_H 1
| #define HAVE_FCNTL_H 1
| #define HAVE_INTTYPES_H 1
| #define HAVE_LIBINTL_H 1
| #define HAVE_LIMITS_H 1
| #define HAVE_LOCALE_H 1
| #define HAVE_MALLOC_H 1
| #define HAVE_NETDB_H 1
| #define HAVE_NETINET_IN_H 1
| #define HAVE_STDDEF_H 1
| #define HAVE_STDINT_H 1
| #define HAVE_STDLIB_H 1
| #define HAVE_STRING_H 1
| #define HAVE_STRINGS_H 1
| #define HAVE_SYS_FILE_H 1
| #define HAVE_SYS_IOCTL_H 1
| #define HAVE_SYS_PARAM_H 1
| #define HAVE_SYS_SOCKET_H 1
| #define HAVE_SYS_TIME_H 1
| #define HAVE_SYSLOG_H 1
| #define HAVE_TERMIOS_H 1
| #define HAVE_UNISTD_H 1
| #define HAVE_UTIME_H 1
| #define _FILE_OFFSET_BITS 64
| #define HAVE__BOOL 1
| #define HAVE_STDBOOL_H 1
| #define HAVE_STRUCT_STAT_ST_BLKSIZE 1
| #define TIME_WITH_SYS_TIME 1
| #define HAVE_PTRDIFF_T 1
| #define HAVE_UNISTD_H 1
| #define HAVE_CHOWN 1
| #define HAVE_FORK 1
| #define HAVE_VFORK 1
| #define HAVE_WORKING_VFORK 1
| #define HAVE_WORKING_FORK 1
| #define HAVE_FSEEKO 1
| #define HAVE_STDLIB_H 1
| #define HAVE_SYS_TIME_H 1
| #define HAVE_UNISTD_H 1
| #define HAVE_ALARM 1
| #define HAVE_STDLIB_H 1
| #define HAVE_UNISTD_H 1
| #define HAVE_GETPAGESIZE 1
| #define HAVE_MMAP 1
| #define HAVE_SYS_SELECT_H 1
| #define HAVE_SYS_SOCKET_H 1
| #define SELECT_TYPE_ARG1 int
| #define SELECT_TYPE_ARG234 (fd_set *)
| #define SELECT_TYPE_ARG5 (struct timeval *)
| #define PROTOTYPES 1
| #define __PROTOTYPES 1
| #define RETSIGTYPE void
| #define LSTAT_FOLLOWS_SLASHED_SYMLINK 1
| #define HAVE_STRCOLL 1
| #define HAVE_STRFTIME 1
| #define HAVE_UTIME_NULL 1
| #define HAVE_VPRINTF 1
| #define HAVE_ASPRINTF 1
| #define HAVE_ATEXIT 1
| #define HAVE_BZERO 1
| #define HAVE_DUP2 1
| #define HAVE_ENDPWENT 1
| #define HAVE_FTRUNCATE 1
| #define HAVE_GETCWD 1
| #define HAVE_GETHOSTBYNAME 1
| #define HAVE_GETHOSTNAME 1
| #define HAVE_GETLOADAVG 1
| #define HAVE_GETTIMEOFDAY 1
| #define HAVE_INET_NTOA 1
| #define HAVE_ISASCII 1
| #define HAVE_LOCALTIME_R 1
| #define HAVE_MEMCHR 1
| #define HAVE_MEMMOVE 1
| #define HAVE_MEMSET 1
| #define HAVE_MKDIR 1
| #define HAVE_MUNMAP 1
| #define HAVE_PUTENV 1
| #define HAVE_RE_COMP 1
| #define HAVE_REGCOMP 1
| #define HAVE_SELECT 1
| #define HAVE_SETENV 1
| #define HAVE_SOCKET 1
| #define HAVE_STRCASECMP 1
| #define HAVE_STRCASESTR 1
| #define HAVE_STRCHR 1
| #define HAVE_STRCSPN 1
| #define HAVE_STRDUP 1
| #define HAVE_STRERROR 1
| #define HAVE_STRNCASECMP 1
| #define HAVE_STRNDUP 1
| #define HAVE_STRNLEN 1
| #define HAVE_STRRCHR 1
| #define HAVE_STRSEP 1
| #define HAVE_STRSPN 1
| #define HAVE_STRSTR 1
| #define HAVE_STRTOL 1
| #define HAVE_STRTOQ 1
| #define HAVE_UNSETENV 1
| #define HAVE_UTIME 1
| #define HAVE_VASPRINTF 1
| #define HAVE_PTHREAD_RWLOCK_INITIALIZER 1
| #define HAVE_PTHREAD_RWLOCK_PREFER_WRITER_NP 1
| #define HAVE_GCC_ATOMICS 1
| #define HAVE_ATTRIBUTE_pure 1
| #define HAVE_ATTRIBUTE_malloc 1
| #define HAVE_ATTRIBUTE_const 1
| #define HAVE_ATTRIBUTE_unused 1
| #define HAVE_ATTRIBUTE_always_inline 1
| #define HAVE_RES_NINIT 1
| #define HAVE_RTLD_NOLOAD 1
| #define HAVE_IP_MTU_DISCOVER 1
| /* end confdefs.h.  */
| #include <stdio.h>
| #if HAVE_SYS_TYPES_H
| # include <sys/types.h>
| #endif
| #if HAVE_SYS_STAT_H
| # include <sys/stat.h>
| #endif
| #if STDC_HEADERS
| # include <stdlib.h>
| # include <stddef.h>
| #else
| # if HAVE_STDLIB_H
| #  include <stdlib.h>
| # endif
| #endif
| #if HAVE_STRING_H
| # if !STDC_HEADERS && HAVE_MEMORY_H
| #  include <memory.h>
| # endif
| # include <string.h>
| #endif
| #if HAVE_STRINGS_H
| # include <strings.h>
| #endif
| #if HAVE_INTTYPES_H
| # include <inttypes.h>
| #endif
| #if HAVE_STDINT_H
| # include <stdint.h>
| #endif
| #if HAVE_UNISTD_H
| # include <unistd.h>
| #endif
| #include <libkern/OSAtomic.h>
configure:16886: result: no
configure:16890: checking libkern/OSAtomic.h presence
configure:16905: gcc -E  conftest.c
conftest.c:138:30: error: libkern/OSAtomic.h: No such file or directory
configure:16911: $? = 1
configure: failed program was:
| /* confdefs.h.  */
| #define PACKAGE_NAME ""
| #define PACKAGE_TARNAME ""
| #define PACKAGE_VERSION ""
| #define PACKAGE_STRING ""
| #define PACKAGE_BUGREPORT ""
| #define _GNU_SOURCE 1
| #define STDC_HEADERS 1
| #define HAVE_SYS_TYPES_H 1
| #define HAVE_SYS_STAT_H 1
| #define HAVE_STDLIB_H 1
| #define HAVE_STRING_H 1
| #define HAVE_MEMORY_H 1
| #define HAVE_STRINGS_H 1
| #define HAVE_INTTYPES_H 1
| #define HAVE_STDINT_H 1
| #define HAVE_UNISTD_H 1
| #define __EXTENSIONS__ 1
| #define _POSIX_PTHREAD_SEMANTICS 1
| #define HAVE_PTHREAD 1
| #define HAVE_ALLOCA_H 1
| #define HAVE_ALLOCA 1
| #define HAVE_DIRENT_H 1
| #define STDC_HEADERS 1
| #define HAVE_SYS_WAIT_H 1
| #define HAVE_ARPA_INET_H 1
| #define HAVE_FCNTL_H 1
| #define HAVE_INTTYPES_H 1
| #define HAVE_LIBINTL_H 1
| #define HAVE_LIMITS_H 1
| #define HAVE_LOCALE_H 1
| #define HAVE_MALLOC_H 1
| #define HAVE_NETDB_H 1
| #define HAVE_NETINET_IN_H 1
| #define HAVE_STDDEF_H 1
| #define HAVE_STDINT_H 1
| #define HAVE_STDLIB_H 1
| #define HAVE_STRING_H 1
| #define HAVE_STRINGS_H 1
| #define HAVE_SYS_FILE_H 1
| #define HAVE_SYS_IOCTL_H 1
| #define HAVE_SYS_PARAM_H 1
| #define HAVE_SYS_SOCKET_H 1
| #define HAVE_SYS_TIME_H 1
| #define HAVE_SYSLOG_H 1
| #define HAVE_TERMIOS_H 1
| #define HAVE_UNISTD_H 1
| #define HAVE_UTIME_H 1
| #define _FILE_OFFSET_BITS 64
| #define HAVE__BOOL 1
| #define HAVE_STDBOOL_H 1
| #define HAVE_STRUCT_STAT_ST_BLKSIZE 1
| #define TIME_WITH_SYS_TIME 1
| #define HAVE_PTRDIFF_T 1
| #define HAVE_UNISTD_H 1
| #define HAVE_CHOWN 1
| #define HAVE_FORK 1
| #define HAVE_VFORK 1
| #define HAVE_WORKING_VFORK 1
| #define HAVE_WORKING_FORK 1
| #define HAVE_FSEEKO 1
| #define HAVE_STDLIB_H 1
| #define HAVE_SYS_TIME_H 1
| #define HAVE_UNISTD_H 1
| #define HAVE_ALARM 1
| #define HAVE_STDLIB_H 1
| #define HAVE_UNISTD_H 1
| #define HAVE_GETPAGESIZE 1
| #define HAVE_MMAP 1
| #define HAVE_SYS_SELECT_H 1
| #define HAVE_SYS_SOCKET_H 1
| #define SELECT_TYPE_ARG1 int
| #define SELECT_TYPE_ARG234 (fd_set *)
| #define SELECT_TYPE_ARG5 (struct timeval *)
| #define PROTOTYPES 1
| #define __PROTOTYPES 1
| #define RETSIGTYPE void
| #define LSTAT_FOLLOWS_SLASHED_SYMLINK 1
| #define HAVE_STRCOLL 1
| #define HAVE_STRFTIME 1
| #define HAVE_UTIME_NULL 1
| #define HAVE_VPRINTF 1
| #define HAVE_ASPRINTF 1
| #define HAVE_ATEXIT 1
| #define HAVE_BZERO 1
| #define HAVE_DUP2 1
| #define HAVE_ENDPWENT 1
| #define HAVE_FTRUNCATE 1
| #define HAVE_GETCWD 1
| #define HAVE_GETHOSTBYNAME 1
| #define HAVE_GETHOSTNAME 1
| #define HAVE_GETLOADAVG 1
| #define HAVE_GETTIMEOFDAY 1
| #define HAVE_INET_NTOA 1
| #define HAVE_ISASCII 1
| #define HAVE_LOCALTIME_R 1
| #define HAVE_MEMCHR 1
| #define HAVE_MEMMOVE 1
| #define HAVE_MEMSET 1
| #define HAVE_MKDIR 1
| #define HAVE_MUNMAP 1
| #define HAVE_PUTENV 1
| #define HAVE_RE_COMP 1
| #define HAVE_REGCOMP 1
| #define HAVE_SELECT 1
| #define HAVE_SETENV 1
| #define HAVE_SOCKET 1
| #define HAVE_STRCASECMP 1
| #define HAVE_STRCASESTR 1
| #define HAVE_STRCHR 1
| #define HAVE_STRCSPN 1
| #define HAVE_STRDUP 1
| #define HAVE_STRERROR 1
| #define HAVE_STRNCASECMP 1
| #define HAVE_STRNDUP 1
| #define HAVE_STRNLEN 1
| #define HAVE_STRRCHR 1
| #define HAVE_STRSEP 1
| #define HAVE_STRSPN 1
| #define HAVE_STRSTR 1
| #define HAVE_STRTOL 1
| #define HAVE_STRTOQ 1
| #define HAVE_UNSETENV 1
| #define HAVE_UTIME 1
| #define HAVE_VASPRINTF 1
| #define HAVE_PTHREAD_RWLOCK_INITIALIZER 1
| #define HAVE_PTHREAD_RWLOCK_PREFER_WRITER_NP 1
| #define HAVE_GCC_ATOMICS 1
| #define HAVE_ATTRIBUTE_pure 1
| #define HAVE_ATTRIBUTE_malloc 1
| #define HAVE_ATTRIBUTE_const 1
| #define HAVE_ATTRIBUTE_unused 1
| #define HAVE_ATTRIBUTE_always_inline 1
| #define HAVE_RES_NINIT 1
| #define HAVE_RTLD_NOLOAD 1
| #define HAVE_IP_MTU_DISCOVER 1
| /* end confdefs.h.  */
| #include <libkern/OSAtomic.h>
configure:16932: result: no
configure:16960: checking for libkern/OSAtomic.h
configure:16967: result: no
configure:16981: checking for int
configure:17011: gcc -c -O2 -march=pentium4 -pipe -fomit-frame-pointer  conftest.c >&5
configure:17017: $? = 0
configure:17024: test -z "$ac_c_werror_flag" || test ! -s conftest.err
configure:17027: $? = 0
configure:17034: test -s conftest.o
configure:17037: $? = 0
configure:17049: result: yes
configure:17052: checking size of int
configure:17440: gcc -o conftest -O2 -march=pentium4 -pipe -fomit-frame-pointer   conftest.c  >&5
configure:17443: $? = 0
configure:17449: ./conftest
configure:17452: $? = 0
configure:17474: result: 4
configure:17494: checking for snd_spcm_init in -lasound
configure:17529: gcc -o conftest -O2 -march=pentium4 -pipe -fomit-frame-pointer   conftest.c -lasound  -lm -ldl  >&5
configure:17535: $? = 0
configure:17542: test -z "$ac_c_werror_flag" || test ! -s conftest.err
configure:17545: $? = 0
configure:17552: test -s conftest
configure:17555: $? = 0
configure:17569: result: yes
configure:17760: checking alsa/asoundlib.h usability
configure:17777: gcc -c -O2 -march=pentium4 -pipe -fomit-frame-pointer  conftest.c >&5
configure:17783: $? = 0
configure:17790: test -z "$ac_c_werror_flag" || test ! -s conftest.err
configure:17793: $? = 0
configure:17800: test -s conftest.o
configure:17803: $? = 0
configure:17814: result: yes
configure:17818: checking alsa/asoundlib.h presence
configure:17833: gcc -E  conftest.c
configure:17839: $? = 0
configure:17860: result: yes
configure:17888: checking for alsa/asoundlib.h
configure:17895: result: yes
configure:17957: checking for initscr in -lcurses
configure:17992: gcc -o conftest -O2 -march=pentium4 -pipe -fomit-frame-pointer   conftest.c -lcurses -L/usr/lib   >&5
configure:17998: $? = 0
configure:18005: test -z "$ac_c_werror_flag" || test ! -s conftest.err
configure:18008: $? = 0
configure:18015: test -s conftest
configure:18018: $? = 0
configure:18032: result: yes
configure:18062: checking /usr/include/curses.h usability
configure:18079: gcc -c -O2 -march=pentium4 -pipe -fomit-frame-pointer  -I/usr/include conftest.c >&5
configure:18085: $? = 0
configure:18092: test -z "$ac_c_werror_flag" || test ! -s conftest.err
configure:18095: $? = 0
configure:18102: test -s conftest.o
configure:18105: $? = 0
configure:18116: result: yes
configure:18120: checking /usr/include/curses.h presence
configure:18135: gcc -E  -I/usr/include conftest.c
configure:18141: $? = 0
configure:18162: result: yes
configure:18190: checking for /usr/include/curses.h
configure:18198: result: yes
configure:18428: checking for gsm_create in -lgsm
configure:18463: gcc -o conftest -O2 -march=pentium4 -pipe -fomit-frame-pointer   conftest.c -lgsm   >&5
/usr/lib/gcc/i686-pc-linux-gnu/4.1.1/../../../../i686-pc-linux-gnu/bin/ld: cannot find -lgsm
collect2: ld returned 1 exit status
configure:18469: $? = 1
configure: failed program was:
| /* confdefs.h.  */
| #define PACKAGE_NAME ""
| #define PACKAGE_TARNAME ""
| #define PACKAGE_VERSION ""
| #define PACKAGE_STRING ""
| #define PACKAGE_BUGREPORT ""
| #define _GNU_SOURCE 1
| #define STDC_HEADERS 1
| #define HAVE_SYS_TYPES_H 1
| #define HAVE_SYS_STAT_H 1
| #define HAVE_STDLIB_H 1
| #define HAVE_STRING_H 1
| #define HAVE_MEMORY_H 1
| #define HAVE_STRINGS_H 1
| #define HAVE_INTTYPES_H 1
| #define HAVE_STDINT_H 1
| #define HAVE_UNISTD_H 1
| #define __EXTENSIONS__ 1
| #define _POSIX_PTHREAD_SEMANTICS 1
| #define HAVE_PTHREAD 1
| #define HAVE_ALLOCA_H 1
| #define HAVE_ALLOCA 1
| #define HAVE_DIRENT_H 1
| #define STDC_HEADERS 1
| #define HAVE_SYS_WAIT_H 1
| #define HAVE_ARPA_INET_H 1
| #define HAVE_FCNTL_H 1
| #define HAVE_INTTYPES_H 1
| #define HAVE_LIBINTL_H 1
| #define HAVE_LIMITS_H 1
| #define HAVE_LOCALE_H 1
| #define HAVE_MALLOC_H 1
| #define HAVE_NETDB_H 1
| #define HAVE_NETINET_IN_H 1
| #define HAVE_STDDEF_H 1
| #define HAVE_STDINT_H 1
| #define HAVE_STDLIB_H 1
| #define HAVE_STRING_H 1
| #define HAVE_STRINGS_H 1
| #define HAVE_SYS_FILE_H 1
| #define HAVE_SYS_IOCTL_H 1
| #define HAVE_SYS_PARAM_H 1
| #define HAVE_SYS_SOCKET_H 1
| #define HAVE_SYS_TIME_H 1
| #define HAVE_SYSLOG_H 1
| #define HAVE_TERMIOS_H 1
| #define HAVE_UNISTD_H 1
| #define HAVE_UTIME_H 1
| #define _FILE_OFFSET_BITS 64
| #define HAVE__BOOL 1
| #define HAVE_STDBOOL_H 1
| #define HAVE_STRUCT_STAT_ST_BLKSIZE 1
| #define TIME_WITH_SYS_TIME 1
| #define HAVE_PTRDIFF_T 1
| #define HAVE_UNISTD_H 1
| #define HAVE_CHOWN 1
| #define HAVE_FORK 1
| #define HAVE_VFORK 1
| #define HAVE_WORKING_VFORK 1
| #define HAVE_WORKING_FORK 1
| #define HAVE_FSEEKO 1
| #define HAVE_STDLIB_H 1
| #define HAVE_SYS_TIME_H 1
| #define HAVE_UNISTD_H 1
| #define HAVE_ALARM 1
| #define HAVE_STDLIB_H 1
| #define HAVE_UNISTD_H 1
| #define HAVE_GETPAGESIZE 1
| #define HAVE_MMAP 1
| #define HAVE_SYS_SELECT_H 1
| #define HAVE_SYS_SOCKET_H 1
| #define SELECT_TYPE_ARG1 int
| #define SELECT_TYPE_ARG234 (fd_set *)
| #define SELECT_TYPE_ARG5 (struct timeval *)
| #define PROTOTYPES 1
| #define __PROTOTYPES 1
| #define RETSIGTYPE void
| #define LSTAT_FOLLOWS_SLASHED_SYMLINK 1
| #define HAVE_STRCOLL 1
| #define HAVE_STRFTIME 1
| #define HAVE_UTIME_NULL 1
| #define HAVE_VPRINTF 1
| #define HAVE_ASPRINTF 1
| #define HAVE_ATEXIT 1
| #define HAVE_BZERO 1
| #define HAVE_DUP2 1
| #define HAVE_ENDPWENT 1
| #define HAVE_FTRUNCATE 1
| #define HAVE_GETCWD 1
| #define HAVE_GETHOSTBYNAME 1
| #define HAVE_GETHOSTNAME 1
| #define HAVE_GETLOADAVG 1
| #define HAVE_GETTIMEOFDAY 1
| #define HAVE_INET_NTOA 1
| #define HAVE_ISASCII 1
| #define HAVE_LOCALTIME_R 1
| #define HAVE_MEMCHR 1
| #define HAVE_MEMMOVE 1
| #define HAVE_MEMSET 1
| #define HAVE_MKDIR 1
| #define HAVE_MUNMAP 1
| #define HAVE_PUTENV 1
| #define HAVE_RE_COMP 1
| #define HAVE_REGCOMP 1
| #define HAVE_SELECT 1
| #define HAVE_SETENV 1
| #define HAVE_SOCKET 1
| #define HAVE_STRCASECMP 1
| #define HAVE_STRCASESTR 1
| #define HAVE_STRCHR 1
| #define HAVE_STRCSPN 1
| #define HAVE_STRDUP 1
| #define HAVE_STRERROR 1
| #define HAVE_STRNCASECMP 1
| #define HAVE_STRNDUP 1
| #define HAVE_STRNLEN 1
| #define HAVE_STRRCHR 1
| #define HAVE_STRSEP 1
| #define HAVE_STRSPN 1
| #define HAVE_STRSTR 1
| #define HAVE_STRTOL 1
| #define HAVE_STRTOQ 1
| #define HAVE_UNSETENV 1
| #define HAVE_UTIME 1
| #define HAVE_VASPRINTF 1
| #define HAVE_PTHREAD_RWLOCK_INITIALIZER 1
| #define HAVE_PTHREAD_RWLOCK_PREFER_WRITER_NP 1
| #define HAVE_GCC_ATOMICS 1
| #define HAVE_ATTRIBUTE_pure 1
| #define HAVE_ATTRIBUTE_malloc 1
| #define HAVE_ATTRIBUTE_const 1
| #define HAVE_ATTRIBUTE_unused 1
| #define HAVE_ATTRIBUTE_always_inline 1
| #define HAVE_RES_NINIT 1
| #define HAVE_RTLD_NOLOAD 1
| #define HAVE_IP_MTU_DISCOVER 1
| #define SIZEOF_INT 4
| #define HAVE_ALSA 1
| #define HAVE_CURSES 1
| /* end confdefs.h.  */
|
| /* Override any GCC internal prototype to avoid an error.
|    Use char because int might match the return type of a GCC
|    builtin and then its argument prototype would still apply.  */
| #ifdef __cplusplus
| extern "C"
| #endif
| char gsm_create ();
| int
| main ()
| {
| return gsm_create ();
|   ;
|   return 0;
| }
configure:18503: result: no
configure:19211: checking for iks_start_sasl in -liksemel
configure:19246: gcc -o conftest -O2 -march=pentium4 -pipe -fomit-frame-pointer   conftest.c -liksemel    >&5
/usr/lib/gcc/i686-pc-linux-gnu/4.1.1/../../../../i686-pc-linux-gnu/bin/ld: cannot find -liksemel
collect2: ld returned 1 exit status
configure:19252: $? = 1
configure: failed program was:
| /* confdefs.h.  */
| #define PACKAGE_NAME ""
| #define PACKAGE_TARNAME ""
| #define PACKAGE_VERSION ""
| #define PACKAGE_STRING ""
| #define PACKAGE_BUGREPORT ""
| #define _GNU_SOURCE 1
| #define STDC_HEADERS 1
| #define HAVE_SYS_TYPES_H 1
| #define HAVE_SYS_STAT_H 1
| #define HAVE_STDLIB_H 1
| #define HAVE_STRING_H 1
| #define HAVE_MEMORY_H 1
| #define HAVE_STRINGS_H 1
| #define HAVE_INTTYPES_H 1
| #define HAVE_STDINT_H 1
| #define HAVE_UNISTD_H 1
| #define __EXTENSIONS__ 1
| #define _POSIX_PTHREAD_SEMANTICS 1
| #define HAVE_PTHREAD 1
| #define HAVE_ALLOCA_H 1
| #define HAVE_ALLOCA 1
| #define HAVE_DIRENT_H 1
| #define STDC_HEADERS 1
| #define HAVE_SYS_WAIT_H 1
| #define HAVE_ARPA_INET_H 1
| #define HAVE_FCNTL_H 1
| #define HAVE_INTTYPES_H 1
| #define HAVE_LIBINTL_H 1
| #define HAVE_LIMITS_H 1
| #define HAVE_LOCALE_H 1
| #define HAVE_MALLOC_H 1
| #define HAVE_NETDB_H 1
| #define HAVE_NETINET_IN_H 1
| #define HAVE_STDDEF_H 1
| #define HAVE_STDINT_H 1
| #define HAVE_STDLIB_H 1
| #define HAVE_STRING_H 1
| #define HAVE_STRINGS_H 1
| #define HAVE_SYS_FILE_H 1
| #define HAVE_SYS_IOCTL_H 1
| #define HAVE_SYS_PARAM_H 1
| #define HAVE_SYS_SOCKET_H 1
| #define HAVE_SYS_TIME_H 1
| #define HAVE_SYSLOG_H 1
| #define HAVE_TERMIOS_H 1
| #define HAVE_UNISTD_H 1
| #define HAVE_UTIME_H 1
| #define _FILE_OFFSET_BITS 64
| #define HAVE__BOOL 1
| #define HAVE_STDBOOL_H 1
| #define HAVE_STRUCT_STAT_ST_BLKSIZE 1
| #define TIME_WITH_SYS_TIME 1
| #define HAVE_PTRDIFF_T 1
| #define HAVE_UNISTD_H 1
| #define HAVE_CHOWN 1
| #define HAVE_FORK 1
| #define HAVE_VFORK 1
| #define HAVE_WORKING_VFORK 1
| #define HAVE_WORKING_FORK 1
| #define HAVE_FSEEKO 1
| #define HAVE_STDLIB_H 1
| #define HAVE_SYS_TIME_H 1
| #define HAVE_UNISTD_H 1
| #define HAVE_ALARM 1
| #define HAVE_STDLIB_H 1
| #define HAVE_UNISTD_H 1
| #define HAVE_GETPAGESIZE 1
| #define HAVE_MMAP 1
| #define HAVE_SYS_SELECT_H 1
| #define HAVE_SYS_SOCKET_H 1
| #define SELECT_TYPE_ARG1 int
| #define SELECT_TYPE_ARG234 (fd_set *)
| #define SELECT_TYPE_ARG5 (struct timeval *)
| #define PROTOTYPES 1
| #define __PROTOTYPES 1
| #define RETSIGTYPE void
| #define LSTAT_FOLLOWS_SLASHED_SYMLINK 1
| #define HAVE_STRCOLL 1
| #define HAVE_STRFTIME 1
| #define HAVE_UTIME_NULL 1
| #define HAVE_VPRINTF 1
| #define HAVE_ASPRINTF 1
| #define HAVE_ATEXIT 1
| #define HAVE_BZERO 1
| #define HAVE_DUP2 1
| #define HAVE_ENDPWENT 1
| #define HAVE_FTRUNCATE 1
| #define HAVE_GETCWD 1
| #define HAVE_GETHOSTBYNAME 1
| #define HAVE_GETHOSTNAME 1
| #define HAVE_GETLOADAVG 1
| #define HAVE_GETTIMEOFDAY 1
| #define HAVE_INET_NTOA 1
| #define HAVE_ISASCII 1
| #define HAVE_LOCALTIME_R 1
| #define HAVE_MEMCHR 1
| #define HAVE_MEMMOVE 1
| #define HAVE_MEMSET 1
| #define HAVE_MKDIR 1
| #define HAVE_MUNMAP 1
| #define HAVE_PUTENV 1
| #define HAVE_RE_COMP 1
| #define HAVE_REGCOMP 1
| #define HAVE_SELECT 1
| #define HAVE_SETENV 1
| #define HAVE_SOCKET 1
| #define HAVE_STRCASECMP 1
| #define HAVE_STRCASESTR 1
| #define HAVE_STRCHR 1
| #define HAVE_STRCSPN 1
| #define HAVE_STRDUP 1
| #define HAVE_STRERROR 1
| #define HAVE_STRNCASECMP 1
| #define HAVE_STRNDUP 1
| #define HAVE_STRNLEN 1
| #define HAVE_STRRCHR 1
| #define HAVE_STRSEP 1
| #define HAVE_STRSPN 1
| #define HAVE_STRSTR 1
| #define HAVE_STRTOL 1
| #define HAVE_STRTOQ 1
| #define HAVE_UNSETENV 1
| #define HAVE_UTIME 1
| #define HAVE_VASPRINTF 1
| #define HAVE_PTHREAD_RWLOCK_INITIALIZER 1
| #define HAVE_PTHREAD_RWLOCK_PREFER_WRITER_NP 1
| #define HAVE_GCC_ATOMICS 1
| #define HAVE_ATTRIBUTE_pure 1
| #define HAVE_ATTRIBUTE_malloc 1
| #define HAVE_ATTRIBUTE_const 1
| #define HAVE_ATTRIBUTE_unused 1
| #define HAVE_ATTRIBUTE_always_inline 1
| #define HAVE_RES_NINIT 1
| #define HAVE_RTLD_NOLOAD 1
| #define HAVE_IP_MTU_DISCOVER 1
| #define SIZEOF_INT 4
| #define HAVE_ALSA 1
| #define HAVE_CURSES 1
| #define HAVE_GSM_HEADER 1
| /* end confdefs.h.  */
|
| /* Override any GCC internal prototype to avoid an error.
|    Use char because int might match the return type of a GCC
|    builtin and then its argument prototype would still apply.  */
| #ifdef __cplusplus
| extern "C"
| #endif
| char iks_start_sasl ();
| int
| main ()
| {
| return iks_start_sasl ();
|   ;
|   return 0;
| }
configure:19286: result: no
configure:20146: checking for UW IMAP Toolkit c-client library
configure:20224: gcc -o conftest -O2 -march=pentium4 -pipe -fomit-frame-pointer  -I/root/asterisk-release/asterisk-1.4.2/../imap-2004g/c-client  conftest.c  /root/asterisk-release/asterisk-1.4.2/../imap-2004g/c-client/c-client.a  >&5
gcc: /root/asterisk-release/asterisk-1.4.2/../imap-2004g/c-client/c-client.a: No such file or directory
conftest.c:142:22: error: c-client.h: No such file or directory
conftest.c:143: error: expected ')' before '*' token
conftest.c:146: error: expected ')' before '*' token
conftest.c:149: error: expected ')' before '*' token
conftest.c:152: error: expected ')' before '*' token
conftest.c:155: error: expected ')' before '*' token
conftest.c:158: error: expected ')' before '*' token
conftest.c:161: error: expected ')' before '*' token
conftest.c:164: error: expected ')' before '*' token
conftest.c:173: error: expected ')' before '*' token
conftest.c:176: error: expected ')' before '*' token
conftest.c:179: error: expected ')' before '*' token
conftest.c:182: error: expected ')' before '*' token
conftest.c: In function 'main':
conftest.c:192: error: 'MAILSTREAM' undeclared (first use in this function)
conftest.c:192: error: (Each undeclared identifier is reported only once
conftest.c:192: error: for each function it appears in.)
conftest.c:192: error: 'foo' undeclared (first use in this function)
conftest.c:192: error: 'NULL' undeclared (first use in this function)
configure:20230: $? = 1
configure: failed program was:
| /* confdefs.h.  */
| #define PACKAGE_NAME ""
| #define PACKAGE_TARNAME ""
| #define PACKAGE_VERSION ""
| #define PACKAGE_STRING ""
| #define PACKAGE_BUGREPORT ""
| #define _GNU_SOURCE 1
| #define STDC_HEADERS 1
| #define HAVE_SYS_TYPES_H 1
| #define HAVE_SYS_STAT_H 1
| #define HAVE_STDLIB_H 1
| #define HAVE_STRING_H 1
| #define HAVE_MEMORY_H 1
| #define HAVE_STRINGS_H 1
| #define HAVE_INTTYPES_H 1
| #define HAVE_STDINT_H 1
| #define HAVE_UNISTD_H 1
| #define __EXTENSIONS__ 1
| #define _POSIX_PTHREAD_SEMANTICS 1
| #define HAVE_PTHREAD 1
| #define HAVE_ALLOCA_H 1
| #define HAVE_ALLOCA 1
| #define HAVE_DIRENT_H 1
| #define STDC_HEADERS 1
| #define HAVE_SYS_WAIT_H 1
| #define HAVE_ARPA_INET_H 1
| #define HAVE_FCNTL_H 1
| #define HAVE_INTTYPES_H 1
| #define HAVE_LIBINTL_H 1
| #define HAVE_LIMITS_H 1
| #define HAVE_LOCALE_H 1
| #define HAVE_MALLOC_H 1
| #define HAVE_NETDB_H 1
| #define HAVE_NETINET_IN_H 1
| #define HAVE_STDDEF_H 1
| #define HAVE_STDINT_H 1
| #define HAVE_STDLIB_H 1
| #define HAVE_STRING_H 1
| #define HAVE_STRINGS_H 1
| #define HAVE_SYS_FILE_H 1
| #define HAVE_SYS_IOCTL_H 1
| #define HAVE_SYS_PARAM_H 1
| #define HAVE_SYS_SOCKET_H 1
| #define HAVE_SYS_TIME_H 1
| #define HAVE_SYSLOG_H 1
| #define HAVE_TERMIOS_H 1
| #define HAVE_UNISTD_H 1
| #define HAVE_UTIME_H 1
| #define _FILE_OFFSET_BITS 64
| #define HAVE__BOOL 1
| #define HAVE_STDBOOL_H 1
| #define HAVE_STRUCT_STAT_ST_BLKSIZE 1
| #define TIME_WITH_SYS_TIME 1
| #define HAVE_PTRDIFF_T 1
| #define HAVE_UNISTD_H 1
| #define HAVE_CHOWN 1
| #define HAVE_FORK 1
| #define HAVE_VFORK 1
| #define HAVE_WORKING_VFORK 1
| #define HAVE_WORKING_FORK 1
| #define HAVE_FSEEKO 1
| #define HAVE_STDLIB_H 1
| #define HAVE_SYS_TIME_H 1
| #define HAVE_UNISTD_H 1
| #define HAVE_ALARM 1
| #define HAVE_STDLIB_H 1
| #define HAVE_UNISTD_H 1
| #define HAVE_GETPAGESIZE 1
| #define HAVE_MMAP 1
| #define HAVE_SYS_SELECT_H 1
| #define HAVE_SYS_SOCKET_H 1
| #define SELECT_TYPE_ARG1 int
| #define SELECT_TYPE_ARG234 (fd_set *)
| #define SELECT_TYPE_ARG5 (struct timeval *)
| #define PROTOTYPES 1
| #define __PROTOTYPES 1
| #define RETSIGTYPE void
| #define LSTAT_FOLLOWS_SLASHED_SYMLINK 1
| #define HAVE_STRCOLL 1
| #define HAVE_STRFTIME 1
| #define HAVE_UTIME_NULL 1
| #define HAVE_VPRINTF 1
| #define HAVE_ASPRINTF 1
| #define HAVE_ATEXIT 1
| #define HAVE_BZERO 1
| #define HAVE_DUP2 1
| #define HAVE_ENDPWENT 1
| #define HAVE_FTRUNCATE 1
| #define HAVE_GETCWD 1
| #define HAVE_GETHOSTBYNAME 1
| #define HAVE_GETHOSTNAME 1
| #define HAVE_GETLOADAVG 1
| #define HAVE_GETTIMEOFDAY 1
| #define HAVE_INET_NTOA 1
| #define HAVE_ISASCII 1
| #define HAVE_LOCALTIME_R 1
| #define HAVE_MEMCHR 1
| #define HAVE_MEMMOVE 1
| #define HAVE_MEMSET 1
| #define HAVE_MKDIR 1
| #define HAVE_MUNMAP 1
| #define HAVE_PUTENV 1
| #define HAVE_RE_COMP 1
| #define HAVE_REGCOMP 1
| #define HAVE_SELECT 1
| #define HAVE_SETENV 1
| #define HAVE_SOCKET 1
| #define HAVE_STRCASECMP 1
| #define HAVE_STRCASESTR 1
| #define HAVE_STRCHR 1
| #define HAVE_STRCSPN 1
| #define HAVE_STRDUP 1
| #define HAVE_STRERROR 1
| #define HAVE_STRNCASECMP 1
| #define HAVE_STRNDUP 1
| #define HAVE_STRNLEN 1
| #define HAVE_STRRCHR 1
| #define HAVE_STRSEP 1
| #define HAVE_STRSPN 1
| #define HAVE_STRSTR 1
| #define HAVE_STRTOL 1
| #define HAVE_STRTOQ 1
| #define HAVE_UNSETENV 1
| #define HAVE_UTIME 1
| #define HAVE_VASPRINTF 1
| #define HAVE_PTHREAD_RWLOCK_INITIALIZER 1
| #define HAVE_PTHREAD_RWLOCK_PREFER_WRITER_NP 1
| #define HAVE_GCC_ATOMICS 1
| #define HAVE_ATTRIBUTE_pure 1
| #define HAVE_ATTRIBUTE_malloc 1
| #define HAVE_ATTRIBUTE_const 1
| #define HAVE_ATTRIBUTE_unused 1
| #define HAVE_ATTRIBUTE_always_inline 1
| #define HAVE_RES_NINIT 1
| #define HAVE_RTLD_NOLOAD 1
| #define HAVE_IP_MTU_DISCOVER 1
| #define SIZEOF_INT 4
| #define HAVE_ALSA 1
| #define HAVE_CURSES 1
| #define HAVE_GSM_HEADER 1
| /* end confdefs.h.  */
| #include "c-client.h"
|               void mm_searched (MAILSTREAM *stream,unsigned long number)
|               {
|               }
|               void mm_exists (MAILSTREAM *stream,unsigned long number)
|               {
|               }
|               void mm_expunged (MAILSTREAM *stream,unsigned long number)
|               {
|               }
|               void mm_flags (MAILSTREAM *stream,unsigned long number)
|               {
|               }
|               void mm_notify (MAILSTREAM *stream,char *string,long errflg)
|               {
|               }
|               void mm_list (MAILSTREAM *stream,int delimiter,char *mailbox,long attributes)
|               {
|               }
|               void mm_lsub (MAILSTREAM *stream,int delimiter,char *mailbox,long attributes)
|               {
|               }
|               void mm_status (MAILSTREAM *stream,char *mailbox,MAILSTATUS *status)
|               {
|               }
|               void mm_log (char *string,long errflg)
|               {
|               }
|               void mm_dlog (char *string)
|               {
|               }
|               void mm_login (NETMBX *mb,char *user,char *pwd,long trial)
|               {
|               }
|               void mm_critical (MAILSTREAM *stream)
|               {
|               }
|               void mm_nocritical (MAILSTREAM *stream)
|               {
|               }
|               long mm_diskerror (MAILSTREAM *stream,long errcode,long serious)
|               {
|               }
|               void mm_fatal (char *string)
|               {
|               }
| int
| main ()
| {
|
|               MAILSTREAM *foo = mail_open(NULL, "", 0);
|
|
|   ;
|   return 0;
| }
configure:20406: result: no
configure:20419: checking for crashHandler in -lkdecore
configure:20454: g++ -o conftest -O2 -march=pentium4 -pipe -fomit-frame-pointer  -I/include  conftest.cpp  -L/lib -lkdecore >&5
conftest.cpp:142:20: error: kcrash.h: No such file or directory
conftest.cpp: In function 'int main()':
conftest.cpp:146: error: 'KCrash' has not been declared
conftest.cpp:146: error: invalid type in declaration before '(' token
configure:20460: $? = 1
configure: failed program was:
| /* confdefs.h.  */
| #define PACKAGE_NAME ""
| #define PACKAGE_TARNAME ""
| #define PACKAGE_VERSION ""
| #define PACKAGE_STRING ""
| #define PACKAGE_BUGREPORT ""
| #define _GNU_SOURCE 1
| #define STDC_HEADERS 1
| #define HAVE_SYS_TYPES_H 1
| #define HAVE_SYS_STAT_H 1
| #define HAVE_STDLIB_H 1
| #define HAVE_STRING_H 1
| #define HAVE_MEMORY_H 1
| #define HAVE_STRINGS_H 1
| #define HAVE_INTTYPES_H 1
| #define HAVE_STDINT_H 1
| #define HAVE_UNISTD_H 1
| #define __EXTENSIONS__ 1
| #define _POSIX_PTHREAD_SEMANTICS 1
| #define HAVE_PTHREAD 1
| #define HAVE_ALLOCA_H 1
| #define HAVE_ALLOCA 1
| #define HAVE_DIRENT_H 1
| #define STDC_HEADERS 1
| #define HAVE_SYS_WAIT_H 1
| #define HAVE_ARPA_INET_H 1
| #define HAVE_FCNTL_H 1
| #define HAVE_INTTYPES_H 1
| #define HAVE_LIBINTL_H 1
| #define HAVE_LIMITS_H 1
| #define HAVE_LOCALE_H 1
| #define HAVE_MALLOC_H 1
| #define HAVE_NETDB_H 1
| #define HAVE_NETINET_IN_H 1
| #define HAVE_STDDEF_H 1
| #define HAVE_STDINT_H 1
| #define HAVE_STDLIB_H 1
| #define HAVE_STRING_H 1
| #define HAVE_STRINGS_H 1
| #define HAVE_SYS_FILE_H 1
| #define HAVE_SYS_IOCTL_H 1
| #define HAVE_SYS_PARAM_H 1
| #define HAVE_SYS_SOCKET_H 1
| #define HAVE_SYS_TIME_H 1
| #define HAVE_SYSLOG_H 1
| #define HAVE_TERMIOS_H 1
| #define HAVE_UNISTD_H 1
| #define HAVE_UTIME_H 1
| #define _FILE_OFFSET_BITS 64
| #define HAVE__BOOL 1
| #define HAVE_STDBOOL_H 1
| #define HAVE_STRUCT_STAT_ST_BLKSIZE 1
| #define TIME_WITH_SYS_TIME 1
| #define HAVE_PTRDIFF_T 1
| #define HAVE_UNISTD_H 1
| #define HAVE_CHOWN 1
| #define HAVE_FORK 1
| #define HAVE_VFORK 1
| #define HAVE_WORKING_VFORK 1
| #define HAVE_WORKING_FORK 1
| #define HAVE_FSEEKO 1
| #define HAVE_STDLIB_H 1
| #define HAVE_SYS_TIME_H 1
| #define HAVE_UNISTD_H 1
| #define HAVE_ALARM 1
| #define HAVE_STDLIB_H 1
| #define HAVE_UNISTD_H 1
| #define HAVE_GETPAGESIZE 1
| #define HAVE_MMAP 1
| #define HAVE_SYS_SELECT_H 1
| #define HAVE_SYS_SOCKET_H 1
| #define SELECT_TYPE_ARG1 int
| #define SELECT_TYPE_ARG234 (fd_set *)
| #define SELECT_TYPE_ARG5 (struct timeval *)
| #define PROTOTYPES 1
| #define __PROTOTYPES 1
| #define RETSIGTYPE void
| #define LSTAT_FOLLOWS_SLASHED_SYMLINK 1
| #define HAVE_STRCOLL 1
| #define HAVE_STRFTIME 1
| #define HAVE_UTIME_NULL 1
| #define HAVE_VPRINTF 1
| #define HAVE_ASPRINTF 1
| #define HAVE_ATEXIT 1
| #define HAVE_BZERO 1
| #define HAVE_DUP2 1
| #define HAVE_ENDPWENT 1
| #define HAVE_FTRUNCATE 1
| #define HAVE_GETCWD 1
| #define HAVE_GETHOSTBYNAME 1
| #define HAVE_GETHOSTNAME 1
| #define HAVE_GETLOADAVG 1
| #define HAVE_GETTIMEOFDAY 1
| #define HAVE_INET_NTOA 1
| #define HAVE_ISASCII 1
| #define HAVE_LOCALTIME_R 1
| #define HAVE_MEMCHR 1
| #define HAVE_MEMMOVE 1
| #define HAVE_MEMSET 1
| #define HAVE_MKDIR 1
| #define HAVE_MUNMAP 1
| #define HAVE_PUTENV 1
| #define HAVE_RE_COMP 1
| #define HAVE_REGCOMP 1
| #define HAVE_SELECT 1
| #define HAVE_SETENV 1
| #define HAVE_SOCKET 1
| #define HAVE_STRCASECMP 1
| #define HAVE_STRCASESTR 1
| #define HAVE_STRCHR 1
| #define HAVE_STRCSPN 1
| #define HAVE_STRDUP 1
| #define HAVE_STRERROR 1
| #define HAVE_STRNCASECMP 1
| #define HAVE_STRNDUP 1
| #define HAVE_STRNLEN 1
| #define HAVE_STRRCHR 1
| #define HAVE_STRSEP 1
| #define HAVE_STRSPN 1
| #define HAVE_STRSTR 1
| #define HAVE_STRTOL 1
| #define HAVE_STRTOQ 1
| #define HAVE_UNSETENV 1
| #define HAVE_UTIME 1
| #define HAVE_VASPRINTF 1
| #define HAVE_PTHREAD_RWLOCK_INITIALIZER 1
| #define HAVE_PTHREAD_RWLOCK_PREFER_WRITER_NP 1
| #define HAVE_GCC_ATOMICS 1
| #define HAVE_ATTRIBUTE_pure 1
| #define HAVE_ATTRIBUTE_malloc 1
| #define HAVE_ATTRIBUTE_const 1
| #define HAVE_ATTRIBUTE_unused 1
| #define HAVE_ATTRIBUTE_always_inline 1
| #define HAVE_RES_NINIT 1
| #define HAVE_RTLD_NOLOAD 1
| #define HAVE_IP_MTU_DISCOVER 1
| #define SIZEOF_INT 4
| #define HAVE_ALSA 1
| #define HAVE_CURSES 1
| #define HAVE_GSM_HEADER 1
| /* end confdefs.h.  */
| #include "kcrash.h"
| int
| main ()
| {
| KCrash::defaultCrashHandler(1);
|   ;
|   return 0;
| }
|
configure:20511: result: no
configure:20513: ***
configure:20515: *** The KDE installation on this system appears to be broken.
configure:20517: *** Either correct the installation, or run configure
configure:20519: *** including --without-kde.

## ---------------- ##
## Cache variables. ##
## ---------------- ##

ac_cv_build=i686-pc-linux-gnu
ac_cv_c_compiler_gnu=yes
ac_cv_c_const=yes
ac_cv_c_inline=inline
ac_cv_c_volatile=yes
ac_cv_cxx_compiler_gnu=yes
ac_cv_env_CCC_set=
ac_cv_env_CCC_value=
ac_cv_env_CC_set=
ac_cv_env_CC_value=
ac_cv_env_CFLAGS_set=set
ac_cv_env_CFLAGS_value='-O2 -march=pentium4 -pipe -fomit-frame-pointer'
ac_cv_env_CPPFLAGS_set=
ac_cv_env_CPPFLAGS_value=
ac_cv_env_CPP_set=
ac_cv_env_CPP_value=
ac_cv_env_CXXCPP_set=
ac_cv_env_CXXCPP_value=
ac_cv_env_CXXFLAGS_set=set
ac_cv_env_CXXFLAGS_value='-O2 -march=pentium4 -pipe -fomit-frame-pointer'
ac_cv_env_CXX_set=
ac_cv_env_CXX_value=
ac_cv_env_LDFLAGS_set=
ac_cv_env_LDFLAGS_value=
ac_cv_env_build_alias_set=
ac_cv_env_build_alias_value=
ac_cv_env_host_alias_set=
ac_cv_env_host_alias_value=
ac_cv_env_target_alias_set=
ac_cv_env_target_alias_value=
ac_cv_func__doprnt=no
ac_cv_func_alarm=yes
ac_cv_func_alloca_works=yes
ac_cv_func_asprintf=yes
ac_cv_func_atexit=yes
ac_cv_func_bzero=yes
ac_cv_func_chown_works=yes
ac_cv_func_closedir_void=no
ac_cv_func_dup2=yes
ac_cv_func_endpwent=yes
ac_cv_func_floor=no
ac_cv_func_fork=yes
ac_cv_func_fork_works=yes
ac_cv_func_fseeko=yes
ac_cv_func_ftruncate=yes
ac_cv_func_getcwd=yes
ac_cv_func_gethostbyname=yes
ac_cv_func_gethostname=yes
ac_cv_func_getloadavg=yes
ac_cv_func_getpagesize=yes
ac_cv_func_gettimeofday=yes
ac_cv_func_inet_ntoa=yes
ac_cv_func_isascii=yes
ac_cv_func_localtime_r=yes
ac_cv_func_lstat_dereferences_slashed_symlink=yes
ac_cv_func_memchr=yes
ac_cv_func_memcmp_working=yes
ac_cv_func_memmove=yes
ac_cv_func_memset=yes
ac_cv_func_mkdir=yes
ac_cv_func_mmap_fixed_mapped=yes
ac_cv_func_munmap=yes
ac_cv_func_pow=no
ac_cv_func_putenv=yes
ac_cv_func_re_comp=yes
ac_cv_func_regcomp=yes
ac_cv_func_rint=no
ac_cv_func_select=yes
ac_cv_func_select_args='int,fd_set *,struct timeval *'
ac_cv_func_setenv=yes
ac_cv_func_setvbuf_reversed=no
ac_cv_func_socket=yes
ac_cv_func_sqrt=no
ac_cv_func_stat_empty_string_bug=no
ac_cv_func_strcasecmp=yes
ac_cv_func_strcasestr=yes
ac_cv_func_strchr=yes
ac_cv_func_strcoll_works=yes
ac_cv_func_strcspn=yes
ac_cv_func_strdup=yes
ac_cv_func_strerror=yes
ac_cv_func_strftime=yes
ac_cv_func_strncasecmp=yes
ac_cv_func_strndup=yes
ac_cv_func_strnlen=yes
ac_cv_func_strnlen_working=yes
ac_cv_func_strrchr=yes
ac_cv_func_strsep=yes
ac_cv_func_strspn=yes
ac_cv_func_strstr=yes
ac_cv_func_strtod=yes
ac_cv_func_strtol=yes
ac_cv_func_strtoq=yes
ac_cv_func_unsetenv=yes
ac_cv_func_utime=yes
ac_cv_func_utime_null=yes
ac_cv_func_vasprintf=yes
ac_cv_func_vfork=yes
ac_cv_func_vfork_works=yes
ac_cv_func_vprintf=yes
ac_cv_func_working_mktime=yes
ac_cv_header__usr_include_curses_h=yes
ac_cv_header_alsa_asoundlib_h=yes
ac_cv_header_arpa_inet_h=yes
ac_cv_header_dirent_dirent_h=yes
ac_cv_header_fcntl_h=yes
ac_cv_header_inttypes_h=yes
ac_cv_header_libintl_h=yes
ac_cv_header_libkern_OSAtomic_h=no
ac_cv_header_limits_h=yes
ac_cv_header_locale_h=yes
ac_cv_header_malloc_h=yes
ac_cv_header_memory_h=yes
ac_cv_header_minix_config_h=no
ac_cv_header_netdb_h=yes
ac_cv_header_netinet_in_h=yes
ac_cv_header_stdbool_h=yes
ac_cv_header_stdc=yes
ac_cv_header_stddef_h=yes
ac_cv_header_stdint_h=yes
ac_cv_header_stdlib_h=yes
ac_cv_header_string_h=yes
ac_cv_header_strings_h=yes
ac_cv_header_sys_file_h=yes
ac_cv_header_sys_ioctl_h=yes
ac_cv_header_sys_param_h=yes
ac_cv_header_sys_select_h=yes
ac_cv_header_sys_socket_h=yes
ac_cv_header_sys_stat_h=yes
ac_cv_header_sys_time_h=yes
ac_cv_header_sys_types_h=yes
ac_cv_header_sys_wait_h=yes
ac_cv_header_syslog_h=yes
ac_cv_header_termios_h=yes
ac_cv_header_time=yes
ac_cv_header_unistd_h=yes
ac_cv_header_utime_h=yes
ac_cv_header_vfork_h=no
ac_cv_host=i686-pc-linux-gnu
ac_cv_imap_tk=no
ac_cv_lib_asound_snd_spcm_init=yes
ac_cv_lib_curses_initscr=yes
ac_cv_lib_error_at_line=yes
ac_cv_lib_gsm_gsm_create=no
ac_cv_lib_iksemel_iks_start_sasl=no
ac_cv_lib_kde_crash=no
ac_cv_member_struct_stat_st_blksize=yes
ac_cv_objext=o
ac_cv_path_AR=/usr/bin/ar
ac_cv_path_BASENAME=/usr/bin/basename
ac_cv_path_COMPRESS=:
ac_cv_path_DIRNAME=/usr/bin/dirname
ac_cv_path_DOT=/usr/bin/dot
ac_cv_path_EGREP='/bin/grep -E'
ac_cv_path_FIND=/usr/bin/find
ac_cv_path_GREP=/bin/grep
ac_cv_path_ID=/usr/bin/id
ac_cv_path_LN=/bin/ln
ac_cv_path_RUBBER=:
ac_cv_path_SED=/usr/bin/sed
ac_cv_path_SHELL=/bin/sh
ac_cv_path_STRIP=/usr/bin/strip
ac_cv_path_WGET=/usr/bin/wget
ac_cv_path_ac_pt_UNAME=/bin/uname
ac_cv_path_install='/usr/bin/install -c'
ac_cv_prog_AWK=gawk
ac_cv_prog_CPP='gcc -E'
ac_cv_prog_CXXCPP='g++ -E'
ac_cv_prog_ac_ct_CC=gcc
ac_cv_prog_ac_ct_CXX=g++
ac_cv_prog_ac_ct_RANLIB=ranlib
ac_cv_prog_cc_c89=
ac_cv_prog_cc_g=yes
ac_cv_prog_cxx_g=yes
ac_cv_prog_egrep='grep -E'
ac_cv_prog_gcc_traditional=no
ac_cv_safe_to_define___extensions__=yes
ac_cv_search_opendir='none required'
ac_cv_sizeof_int=4
ac_cv_struct_tm=time.h
ac_cv_sys_file_offset_bits=64
ac_cv_sys_large_files=no
ac_cv_sys_largefile_CC=no
ac_cv_sys_largefile_source=no
ac_cv_type__Bool=yes
ac_cv_type_int=yes
ac_cv_type_mode_t=yes
ac_cv_type_off_t=yes
ac_cv_type_pid_t=yes
ac_cv_type_ptrdiff_t=yes
ac_cv_type_signal=void
ac_cv_type_size_t=yes
ac_cv_type_uid_t=yes
ac_cv_working_alloca_h=yes
lt_cv_path_LD=/usr/i686-pc-linux-gnu/bin/ld
lt_cv_prog_gnu_ld=yes

## ----------------- ##
## Output variables. ##
## ----------------- ##

ALLOCA=''
ALSA_DIR=''
ALSA_INCLUDE=''
ALSA_LIB='-lasound -lm -ldl'
AR='/usr/bin/ar'
AST_DEVMODE=''
AWK='gawk'
BASENAME='/usr/bin/basename'
BUILD_CPU='i686'
BUILD_OS='linux-gnu'
BUILD_PLATFORM='i686-pc-linux-gnu'
BUILD_VENDOR='pc'
CC='gcc'
CFLAGS='-O2 -march=pentium4 -pipe -fomit-frame-pointer'
COMPRESS=':'
CPP='gcc -E'
CPPFLAGS=''
CURL_CONFIG=''
CURL_DIR='/usr/lib/'
CURL_INCLUDE=''
CURL_LIB=''
CURSES_DIR='/usr'
CURSES_INCLUDE='-I/usr/include'
CURSES_LIB='-L/usr/lib -lcurses '
CXX='g++'
CXXCPP='g++ -E'
CXXFLAGS='-O2 -march=pentium4 -pipe -fomit-frame-pointer'
DEFS=''
DIRNAME='/usr/bin/dirname'
DOT='/usr/bin/dot'
DOWNLOAD='/usr/bin/wget'
ECHO_C=''
ECHO_N='-n'
ECHO_T=''
EDITLINE_LIB=''
EGREP='grep -E'
EXEEXT=''
FETCH=''
FIND='/usr/bin/find'
FREETDS_DIR='/usr'
FREETDS_INCLUDE=''
FREETDS_LIB=''
GC_CFLAGS='-ffunction-sections'
GC_LDFLAGS='-Wl,--gc-sections'
GNUTLS_DIR=''
GNUTLS_INCLUDE=''
GNUTLS_LIB=''
GNU_LD='1'
GNU_MAKE='make'
GREP='/bin/grep'
GSM_DIR=''
GSM_INCLUDE=''
GSM_INTERNAL='yes'
GSM_LIB=''
GTK2_INCLUDE=''
GTK2_LIB=''
GTKCONFIG=''
GTK_INCLUDE=''
GTK_LIB=''
HOST_CPU='i686'
HOST_OS='linux-gnu'
HOST_PLATFORM='i686-pc-linux-gnu'
HOST_VENDOR='pc'
ID='/usr/bin/id'
IKSEMEL_DIR=''
IKSEMEL_INCLUDE=''
IKSEMEL_LIB=''
IMAP_TK_DIR='/root/asterisk-release/asterisk-1.4.2/../imap-2004g'
IMAP_TK_INCLUDE=''
IMAP_TK_LIB=''
INSTALL_DATA='${INSTALL} -m 644'
INSTALL_PROGRAM='${INSTALL}'
INSTALL_SCRIPT='${INSTALL}'
ISDNNET_DIR=''
ISDNNET_INCLUDE=''
ISDNNET_LIB=''
KDEDIR=''
KDEINIT=''
KDE_DIR=''
KDE_INCLUDE=''
KDE_LIB=''
LD='/usr/i686-pc-linux-gnu/bin/ld'
LDFLAGS=''
LIBOBJS=''
LIBS=''
LN='/bin/ln'
LN_S='ln -s'
LTLIBOBJS=''
MISDN_DIR=''
MISDN_INCLUDE=''
MISDN_LIB=''
NBS_DIR=''
NBS_INCLUDE=''
NBS_LIB=''
NCURSES_DIR='/usr'
NCURSES_INCLUDE=''
NCURSES_LIB=''
NETSNMP_CONFIG=''
NETSNMP_DIR='/usr'
NETSNMP_INCLUDE=''
NETSNMP_LIB=''
NEWT_DIR='/usr'
NEWT_INCLUDE=''
NEWT_LIB=''
OBJEXT='o'
OGG_DIR='/usr'
OGG_INCLUDE=''
OGG_LIB=''
OPENH323DIR=''
OPENH323_BUILD=''
OPENH323_DIR='/usr'
OPENH323_INCDIR=''
OPENH323_INCLUDE=''
OPENH323_LIB=''
OPENH323_LIBDIR=''
OPENH323_SUFFIX=''
OPENSSL_DIR='/usr'
OPENSSL_INCLUDE=''
OPENSSL_LIB=''
OSARCH='linux-gnu'
OSPTK_DIR=''
OSPTK_INCLUDE=''
OSPTK_LIB=''
OSS_DIR=''
OSS_INCLUDE=''
OSS_LIB=''
PACKAGE_BUGREPORT=''
PACKAGE_NAME=''
PACKAGE_STRING=''
PACKAGE_TARNAME=''
PACKAGE_VERSION=''
PATH_SEPARATOR=':'
PBX_ALSA='1'
PBX_CURL='0'
PBX_CURSES='1'
PBX_FREETDS='0'
PBX_GNUTLS='0'
PBX_GSM='1'
PBX_GTK2=''
PBX_GTK=''
PBX_H323=''
PBX_IKSEMEL='0'
PBX_IMAP_TK='0'
PBX_ISDNNET='0'
PBX_IXJUSER=''
PBX_KDE='0'
PBX_MISDN='0'
PBX_NBS='0'
PBX_NCURSES='0'
PBX_NETSNMP='0'
PBX_NEWT='0'
PBX_OGG='0'
PBX_OPENH323='0'
PBX_OPENSSL='0'
PBX_OSPTK='0'
PBX_OSREV='2.6.19-gentoo-r5'
PBX_OSS='0'
PBX_PGSQL='0'
PBX_POPT='0'
PBX_PRI='0'
PBX_PWLIB='0'
PBX_QT='0'
PBX_RADIUS='0'
PBX_SPEEX='0'
PBX_SQLITE='0'
PBX_SUPPSERV='0'
PBX_TERMCAP='0'
PBX_TINFO='0'
PBX_TONEZONE='0'
PBX_UNIXODBC='0'
PBX_VORBIS='0'
PBX_VPB='0'
PBX_ZAPTEL='0'
PBX_ZAPTEL_TRANSCODE=''
PBX_ZAPTEL_VLDTMF=''
PBX_ZLIB='0'
PGSQL_DIR='/usr'
PGSQL_INCLUDE=''
PGSQL_LIB=''
PG_CONFIG=''
PKGCONFIG=''
POPT_DIR='/usr'
POPT_INCLUDE=''
POPT_LIB=''
POW_LIB=''
PRI_DIR=''
PRI_INCLUDE=''
PRI_LIB=''
PTHREAD_CC='gcc'
PTHREAD_CFLAGS='-pthread'
PTHREAD_LIBS=''
PTLIB_CONFIG=''
PWLIBDIR=''
PWLIB_DIR='/usr'
PWLIB_INCDIR=''
PWLIB_INCLUDE=''
PWLIB_LIB=''
PWLIB_LIBDIR=''
PWLIB_PLATFORM=''
QTMOC=''
QT_DIR='/usr/include/qt4'
QT_INCLUDE=''
QT_LIB=''
RADIUS_DIR=''
RADIUS_INCLUDE=''
RADIUS_LIB=''
RANLIB='ranlib'
RUBBER=':'
SED='/usr/bin/sed'
SHELL='/bin/sh'
SPEEX_DIR='/usr'
SPEEX_INCLUDE=''
SPEEX_LIB=''
SQLITE_DIR='/usr'
SQLITE_INCLUDE=''
SQLITE_LIB=''
STRIP='/usr/bin/strip'
SUPPSERV_DIR=''
SUPPSERV_INCLUDE=''
SUPPSERV_LIB=''
TERMCAP_DIR='/usr'
TERMCAP_INCLUDE=''
TERMCAP_LIB=''
TINFO_DIR='/usr'
TINFO_INCLUDE=''
TINFO_LIB=''
TONEZONE_DIR=''
TONEZONE_INCLUDE=''
TONEZONE_LIB=''
UNAME='/bin/uname'
UNIXODBC_DIR='/usr'
UNIXODBC_INCLUDE=''
UNIXODBC_LIB=''
VORBIS_DIR='/usr'
VORBIS_INCLUDE=''
VORBIS_LIB=''
VPB_DIR=''
VPB_INCLUDE=''
VPB_LIB=''
WGET='/usr/bin/wget'
ZAPTEL_DIR=''
ZAPTEL_INCLUDE=''
ZAPTEL_LIB=''
ZLIB_DIR='/usr'
ZLIB_INCLUDE=''
ZLIB_LIB=''
ac_ct_CC='gcc'
ac_ct_CXX='g++'
acx_pthread_config=''
bindir='${exec_prefix}/bin'
build='i686-pc-linux-gnu'
build_alias=''
build_cpu='i686'
build_os='linux-gnu'
build_vendor='pc'
datadir='/!/asterisk-data'
datarootdir='${prefix}/share'
docdir='${datarootdir}/doc/${PACKAGE}'
dvidir='${docdir}'
exec_prefix='NONE'
host='i686-pc-linux-gnu'
host_alias=''
host_cpu='i686'
host_os='linux-gnu'
host_vendor='pc'
htmldir='/!/asterisk-docs'
includedir='${prefix}/include'
infodir='${datarootdir}/info'
libdir='${exec_prefix}/lib'
libexecdir='${exec_prefix}/libexec'
localedir='${datarootdir}/locale'
localstatedir='/var'
mandir='${datarootdir}/man'
oldincludedir='/!/asterisk-include-dir'
pdfdir='${docdir}'
prefix='/!/asterisk'
program_transform_name='s,x,x,'
psdir='${docdir}'
sbindir='${exec_prefix}/sbin'
sharedstatedir='${prefix}/com'
sysconfdir='/etc'
target_alias=''

## ----------- ##
## confdefs.h. ##
## ----------- ##

#define PACKAGE_NAME ""
#define PACKAGE_TARNAME ""
#define PACKAGE_VERSION ""
#define PACKAGE_STRING ""
#define PACKAGE_BUGREPORT ""
#define _GNU_SOURCE 1
#define STDC_HEADERS 1
#define HAVE_SYS_TYPES_H 1
#define HAVE_SYS_STAT_H 1
#define HAVE_STDLIB_H 1
#define HAVE_STRING_H 1
#define HAVE_MEMORY_H 1
#define HAVE_STRINGS_H 1
#define HAVE_INTTYPES_H 1
#define HAVE_STDINT_H 1
#define HAVE_UNISTD_H 1
#define __EXTENSIONS__ 1
#define _POSIX_PTHREAD_SEMANTICS 1
#define HAVE_PTHREAD 1
#define HAVE_ALLOCA_H 1
#define HAVE_ALLOCA 1
#define HAVE_DIRENT_H 1
#define STDC_HEADERS 1
#define HAVE_SYS_WAIT_H 1
#define HAVE_ARPA_INET_H 1
#define HAVE_FCNTL_H 1
#define HAVE_INTTYPES_H 1
#define HAVE_LIBINTL_H 1
#define HAVE_LIMITS_H 1
#define HAVE_LOCALE_H 1
#define HAVE_MALLOC_H 1
#define HAVE_NETDB_H 1
#define HAVE_NETINET_IN_H 1
#define HAVE_STDDEF_H 1
#define HAVE_STDINT_H 1
#define HAVE_STDLIB_H 1
#define HAVE_STRING_H 1
#define HAVE_STRINGS_H 1
#define HAVE_SYS_FILE_H 1
#define HAVE_SYS_IOCTL_H 1
#define HAVE_SYS_PARAM_H 1
#define HAVE_SYS_SOCKET_H 1
#define HAVE_SYS_TIME_H 1
#define HAVE_SYSLOG_H 1
#define HAVE_TERMIOS_H 1
#define HAVE_UNISTD_H 1
#define HAVE_UTIME_H 1
#define _FILE_OFFSET_BITS 64
#define HAVE__BOOL 1
#define HAVE_STDBOOL_H 1
#define HAVE_STRUCT_STAT_ST_BLKSIZE 1
#define TIME_WITH_SYS_TIME 1
#define HAVE_PTRDIFF_T 1
#define HAVE_UNISTD_H 1
#define HAVE_CHOWN 1
#define HAVE_FORK 1
#define HAVE_VFORK 1
#define HAVE_WORKING_VFORK 1
#define HAVE_WORKING_FORK 1
#define HAVE_FSEEKO 1
#define HAVE_STDLIB_H 1
#define HAVE_SYS_TIME_H 1
#define HAVE_UNISTD_H 1
#define HAVE_ALARM 1
#define HAVE_STDLIB_H 1
#define HAVE_UNISTD_H 1
#define HAVE_GETPAGESIZE 1
#define HAVE_MMAP 1
#define HAVE_SYS_SELECT_H 1
#define HAVE_SYS_SOCKET_H 1
#define SELECT_TYPE_ARG1 int
#define SELECT_TYPE_ARG234 (fd_set *)
#define SELECT_TYPE_ARG5 (struct timeval *)
#define PROTOTYPES 1
#define __PROTOTYPES 1
#define RETSIGTYPE void
#define LSTAT_FOLLOWS_SLASHED_SYMLINK 1
#define HAVE_STRCOLL 1
#define HAVE_STRFTIME 1
#define HAVE_UTIME_NULL 1
#define HAVE_VPRINTF 1
#define HAVE_ASPRINTF 1
#define HAVE_ATEXIT 1
#define HAVE_BZERO 1
#define HAVE_DUP2 1
#define HAVE_ENDPWENT 1
#define HAVE_FTRUNCATE 1
#define HAVE_GETCWD 1
#define HAVE_GETHOSTBYNAME 1
#define HAVE_GETHOSTNAME 1
#define HAVE_GETLOADAVG 1
#define HAVE_GETTIMEOFDAY 1
#define HAVE_INET_NTOA 1
#define HAVE_ISASCII 1
#define HAVE_LOCALTIME_R 1
#define HAVE_MEMCHR 1
#define HAVE_MEMMOVE 1
#define HAVE_MEMSET 1
#define HAVE_MKDIR 1
#define HAVE_MUNMAP 1
#define HAVE_PUTENV 1
#define HAVE_RE_COMP 1
#define HAVE_REGCOMP 1
#define HAVE_SELECT 1
#define HAVE_SETENV 1
#define HAVE_SOCKET 1
#define HAVE_STRCASECMP 1
#define HAVE_STRCASESTR 1
#define HAVE_STRCHR 1
#define HAVE_STRCSPN 1
#define HAVE_STRDUP 1
#define HAVE_STRERROR 1
#define HAVE_STRNCASECMP 1
#define HAVE_STRNDUP 1
#define HAVE_STRNLEN 1
#define HAVE_STRRCHR 1
#define HAVE_STRSEP 1
#define HAVE_STRSPN 1
#define HAVE_STRSTR 1
#define HAVE_STRTOL 1
#define HAVE_STRTOQ 1
#define HAVE_UNSETENV 1
#define HAVE_UTIME 1
#define HAVE_VASPRINTF 1
#define HAVE_PTHREAD_RWLOCK_INITIALIZER 1
#define HAVE_PTHREAD_RWLOCK_PREFER_WRITER_NP 1
#define HAVE_GCC_ATOMICS 1
#define HAVE_ATTRIBUTE_pure 1
#define HAVE_ATTRIBUTE_malloc 1
#define HAVE_ATTRIBUTE_const 1
#define HAVE_ATTRIBUTE_unused 1
#define HAVE_ATTRIBUTE_always_inline 1
#define HAVE_RES_NINIT 1
#define HAVE_RTLD_NOLOAD 1
#define HAVE_IP_MTU_DISCOVER 1
#define SIZEOF_INT 4
#define HAVE_ALSA 1
#define HAVE_CURSES 1
#define HAVE_GSM_HEADER 1

configure: exit 1
circle asterisk-1.4.2 #