All pastes #433158 Raw Edit

Miscellany

public text v1 · immutable
·published 2007-04-10 16:59 UTC
rendered paste body
Tests run: 77, Failures: 3, Errors: 3, Skipped: 0

[ERROR] mojo-execute : surefire:test
Diagnosis: There are test failures.
FATAL ERROR: Error executing Maven for a project
[ERROR] project-execute : l2jfree:l2j-gameserver:jar:1.0.0 (  task-segment: [assembly:assembly] )
Diagnosis: There are test failures.
FATAL ERROR: Error executing Maven for a project
org.apache.maven.BuildFailureException: There are test failures.
	at org.apache.maven.lifecycle.DefaultLifecycleExecutor.executeGoals(DefaultLifecycleExecutor.java:555)
	at org.apache.maven.lifecycle.DefaultLifecycleExecutor.executeGoalWithLifecycle(DefaultLifecycleExecutor.java:475)
	at org.apache.maven.lifecycle.DefaultLifecycleExecutor.forkProjectLifecycle(DefaultLifecycleExecutor.java:891)
	at org.apache.maven.lifecycle.DefaultLifecycleExecutor.forkLifecycle(DefaultLifecycleExecutor.java:729)
	at org.apache.maven.lifecycle.DefaultLifecycleExecutor.executeGoals(DefaultLifecycleExecutor.java:505)
	at org.apache.maven.lifecycle.DefaultLifecycleExecutor.executeStandaloneGoal(DefaultLifecycleExecutor.java:488)
	at org.apache.maven.lifecycle.DefaultLifecycleExecutor.executeGoal(DefaultLifecycleExecutor.java:458)
	at org.apache.maven.lifecycle.DefaultLifecycleExecutor.executeGoalAndHandleFailures(DefaultLifecycleExecutor.java:306)
	at org.apache.maven.lifecycle.DefaultLifecycleExecutor.executeTaskSegments(DefaultLifecycleExecutor.java:273)
	at org.apache.maven.lifecycle.DefaultLifecycleExecutor.execute(DefaultLifecycleExecutor.java:140)
	at org.apache.maven.embedder.MavenEmbedder.execute(MavenEmbedder.java:441)
	at org.apache.maven.embedder.MavenEmbedder.execute(MavenEmbedder.java:382)
	at org.maven.ide.eclipse.Maven2Executor.main(Maven2Executor.java:68)
Caused by: org.apache.maven.plugin.MojoFailureException: There are test failures.
	at org.apache.maven.plugin.surefire.SurefirePlugin.execute(SurefirePlugin.java:425)
	at org.apache.maven.plugin.DefaultPluginManager.executeMojo(DefaultPluginManager.java:412)
	at org.apache.maven.lifecycle.DefaultLifecycleExecutor.executeGoals(DefaultLifecycleExecutor.java:534)
	... 12 more