All pastes #432622 Raw Edit

Someone

public text v1 · immutable
·published 2007-04-10 11:00 UTC
rendered paste body
ubuntu@ubuntu:~/Desktop/orinoco-usb-0.2.2$ make && sudo make install
make -C driver
make[1]: Entering directory `/home/ubuntu/Desktop/orinoco-usb-0.2.2/driver'
mkdir -p .tmp_versions
cp /lib/modules/2.6.17-10-generic/build/.tmp_versions/*.mod /home/ubuntu/Desktop/orinoco-usb-0.2.2/driver/.tmp_versions
cp: cannot stat `/lib/modules/2.6.17-10-generic/build/.tmp_versions/*.mod': No such file or directory
make[1]: [modules] Error 1 (ignored)
make -C /lib/modules/2.6.17-10-generic/build SUBDIRS=/home/ubuntu/Desktop/orinoco-usb-0.2.2/driver MODVERDIR=/home/ubuntu/Desktop/orinoco-usb-0.2.2/driver/.tmp_versions modules
make[2]: Entering directory `/usr/src/linux-headers-2.6.17-10-generic'
  CC [M]  /home/ubuntu/Desktop/orinoco-usb-0.2.2/driver/hermes.o
In file included from /home/ubuntu/Desktop/orinoco-usb-0.2.2/driver/hermes.c:53:
/home/ubuntu/Desktop/orinoco-usb-0.2.2/driver/hermes.h: In function ‘hermes_present’:
/home/ubuntu/Desktop/orinoco-usb-0.2.2/driver/hermes.h:379: warning: passing argument 1 of ‘readw’ makes pointer from integer without a cast
/home/ubuntu/Desktop/orinoco-usb-0.2.2/driver/hermes.h: In function ‘hermes_set_irqmask’:
/home/ubuntu/Desktop/orinoco-usb-0.2.2/driver/hermes.h:385: warning: passing argument 2 of ‘writew’ makes pointer from integer without a cast
/home/ubuntu/Desktop/orinoco-usb-0.2.2/driver/hermes.h: In function ‘hermes_read_words’:
/home/ubuntu/Desktop/orinoco-usb-0.2.2/driver/hermes.h:426: warning: passing argument 1 of ‘readw’ makes pointer from integer without a cast
/home/ubuntu/Desktop/orinoco-usb-0.2.2/driver/hermes.h: In function ‘hermes_write_words’:
/home/ubuntu/Desktop/orinoco-usb-0.2.2/driver/hermes.h:446: warning: passing argument 2 of ‘writew’ makes pointer from integer without a cast
/home/ubuntu/Desktop/orinoco-usb-0.2.2/driver/hermes.h: In function ‘hermes_clear_words’:
/home/ubuntu/Desktop/orinoco-usb-0.2.2/driver/hermes.h:462: warning: passing argument 2 of ‘writew’ makes pointer from integer without a cast
/home/ubuntu/Desktop/orinoco-usb-0.2.2/driver/hermes.c: In function ‘hermes_issue_cmd’:
/home/ubuntu/Desktop/orinoco-usb-0.2.2/driver/hermes.c:121: warning: passing argument 1 of ‘readw’ makes pointer from integer without a cast
/home/ubuntu/Desktop/orinoco-usb-0.2.2/driver/hermes.c:125: warning: passing argument 1 of ‘readw’ makes pointer from integer without a cast
/home/ubuntu/Desktop/orinoco-usb-0.2.2/driver/hermes.c:131: warning: passing argument 2 of ‘writew’ makes pointer from integer without a cast
/home/ubuntu/Desktop/orinoco-usb-0.2.2/driver/hermes.c:132: warning: passing argument 2 of ‘writew’ makes pointer from integer without a cast
/home/ubuntu/Desktop/orinoco-usb-0.2.2/driver/hermes.c:133: warning: passing argument 2 of ‘writew’ makes pointer from integer without a cast
/home/ubuntu/Desktop/orinoco-usb-0.2.2/driver/hermes.c:134: warning: passing argument 2 of ‘writew’ makes pointer from integer without a cast
/home/ubuntu/Desktop/orinoco-usb-0.2.2/driver/hermes.c: In function ‘hermes_init_direct’:
/home/ubuntu/Desktop/orinoco-usb-0.2.2/driver/hermes.c:174: warning: passing argument 2 of ‘writew’ makes pointer from integer without a cast
/home/ubuntu/Desktop/orinoco-usb-0.2.2/driver/hermes.c:175: warning: passing argument 2 of ‘writew’ makes pointer from integer without a cast
/home/ubuntu/Desktop/orinoco-usb-0.2.2/driver/hermes.c:184: warning: passing argument 1 of ‘readw’ makes pointer from integer without a cast
/home/ubuntu/Desktop/orinoco-usb-0.2.2/driver/hermes.c:192: warning: passing argument 1 of ‘readw’ makes pointer from integer without a cast
/home/ubuntu/Desktop/orinoco-usb-0.2.2/driver/hermes.c:201: warning: passing argument 1 of ‘readw’ makes pointer from integer without a cast
/home/ubuntu/Desktop/orinoco-usb-0.2.2/driver/hermes.c:202: warning: passing argument 2 of ‘writew’ makes pointer from integer without a cast
/home/ubuntu/Desktop/orinoco-usb-0.2.2/driver/hermes.c:210: warning: passing argument 1 of ‘readw’ makes pointer from integer without a cast
/home/ubuntu/Desktop/orinoco-usb-0.2.2/driver/hermes.c:215: warning: passing argument 1 of ‘readw’ makes pointer from integer without a cast
/home/ubuntu/Desktop/orinoco-usb-0.2.2/driver/hermes.c:218: warning: passing argument 2 of ‘writew’ makes pointer from integer without a cast
/home/ubuntu/Desktop/orinoco-usb-0.2.2/driver/hermes.c:235: warning: passing argument 1 of ‘readw’ makes pointer from integer without a cast
/home/ubuntu/Desktop/orinoco-usb-0.2.2/driver/hermes.c:237: warning: passing argument 2 of ‘writew’ makes pointer from integer without a cast
/home/ubuntu/Desktop/orinoco-usb-0.2.2/driver/hermes.c: In function ‘hermes_docmd_wait_direct’:
/home/ubuntu/Desktop/orinoco-usb-0.2.2/driver/hermes.c:273: warning: passing argument 1 of ‘readw’ makes pointer from integer without a cast
/home/ubuntu/Desktop/orinoco-usb-0.2.2/driver/hermes.c:278: warning: passing argument 1 of ‘readw’ makes pointer from integer without a cast
/home/ubuntu/Desktop/orinoco-usb-0.2.2/driver/hermes.c:297: warning: passing argument 1 of ‘readw’ makes pointer from integer without a cast
/home/ubuntu/Desktop/orinoco-usb-0.2.2/driver/hermes.c:300: warning: passing argument 1 of ‘readw’ makes pointer from integer without a cast
/home/ubuntu/Desktop/orinoco-usb-0.2.2/driver/hermes.c:301: warning: passing argument 1 of ‘readw’ makes pointer from integer without a cast
/home/ubuntu/Desktop/orinoco-usb-0.2.2/driver/hermes.c:302: warning: passing argument 1 of ‘readw’ makes pointer from integer without a cast
/home/ubuntu/Desktop/orinoco-usb-0.2.2/driver/hermes.c:305: warning: passing argument 2 of ‘writew’ makes pointer from integer without a cast
/home/ubuntu/Desktop/orinoco-usb-0.2.2/driver/hermes.c: In function ‘hermes_allocate_direct’:
/home/ubuntu/Desktop/orinoco-usb-0.2.2/driver/hermes.c:328: warning: passing argument 1 of ‘readw’ makes pointer from integer without a cast
/home/ubuntu/Desktop/orinoco-usb-0.2.2/driver/hermes.c:333: warning: passing argument 1 of ‘readw’ makes pointer from integer without a cast
/home/ubuntu/Desktop/orinoco-usb-0.2.2/driver/hermes.c:350: warning: passing argument 1 of ‘readw’ makes pointer from integer without a cast
/home/ubuntu/Desktop/orinoco-usb-0.2.2/driver/hermes.c:351: warning: passing argument 2 of ‘writew’ makes pointer from integer without a cast
/home/ubuntu/Desktop/orinoco-usb-0.2.2/driver/hermes.c: In function ‘hermes_bap_seek’:
/home/ubuntu/Desktop/orinoco-usb-0.2.2/driver/hermes.c:375: warning: passing argument 1 of ‘readw’ makes pointer from integer without a cast
/home/ubuntu/Desktop/orinoco-usb-0.2.2/driver/hermes.c:379: warning: passing argument 1 of ‘readw’ makes pointer from integer without a cast
/home/ubuntu/Desktop/orinoco-usb-0.2.2/driver/hermes.c:399: warning: passing argument 2 of ‘writew’ makes pointer from integer without a cast
/home/ubuntu/Desktop/orinoco-usb-0.2.2/driver/hermes.c:400: warning: passing argument 2 of ‘writew’ makes pointer from integer without a cast
/home/ubuntu/Desktop/orinoco-usb-0.2.2/driver/hermes.c:404: warning: passing argument 1 of ‘readw’ makes pointer from integer without a cast
/home/ubuntu/Desktop/orinoco-usb-0.2.2/driver/hermes.c:408: warning: passing argument 1 of ‘readw’ makes pointer from integer without a cast
/home/ubuntu/Desktop/orinoco-usb-0.2.2/driver/hermes.c: In function ‘hermes_read_ltv_direct’:
/home/ubuntu/Desktop/orinoco-usb-0.2.2/driver/hermes.c:503: warning: passing argument 1 of ‘readw’ makes pointer from integer without a cast
/home/ubuntu/Desktop/orinoco-usb-0.2.2/driver/hermes.c:508: warning: passing argument 1 of ‘readw’ makes pointer from integer without a cast
/home/ubuntu/Desktop/orinoco-usb-0.2.2/driver/hermes.c: In function ‘hermes_write_ltv_direct’:
/home/ubuntu/Desktop/orinoco-usb-0.2.2/driver/hermes.c:544: warning: passing argument 2 of ‘writew’ makes pointer from integer without a cast
/home/ubuntu/Desktop/orinoco-usb-0.2.2/driver/hermes.c:545: warning: passing argument 2 of ‘writew’ makes pointer from integer without a cast
  CC [M]  /home/ubuntu/Desktop/orinoco-usb-0.2.2/driver/orinoco.o
In file included from /home/ubuntu/Desktop/orinoco-usb-0.2.2/driver/orinoco.c:444:
/home/ubuntu/Desktop/orinoco-usb-0.2.2/driver/hermes.h: In function ‘hermes_present’:
/home/ubuntu/Desktop/orinoco-usb-0.2.2/driver/hermes.h:379: warning: passing argument 1 of ‘readw’ makes pointer from integer without a cast
/home/ubuntu/Desktop/orinoco-usb-0.2.2/driver/hermes.h: In function ‘hermes_set_irqmask’:
/home/ubuntu/Desktop/orinoco-usb-0.2.2/driver/hermes.h:385: warning: passing argument 2 of ‘writew’ makes pointer from integer without a cast
/home/ubuntu/Desktop/orinoco-usb-0.2.2/driver/hermes.h: In function ‘hermes_read_words’:
/home/ubuntu/Desktop/orinoco-usb-0.2.2/driver/hermes.h:426: warning: passing argument 1 of ‘readw’ makes pointer from integer without a cast
/home/ubuntu/Desktop/orinoco-usb-0.2.2/driver/hermes.h: In function ‘hermes_write_words’:
/home/ubuntu/Desktop/orinoco-usb-0.2.2/driver/hermes.h:446: warning: passing argument 2 of ‘writew’ makes pointer from integer without a cast
/home/ubuntu/Desktop/orinoco-usb-0.2.2/driver/hermes.h: In function ‘hermes_clear_words’:
/home/ubuntu/Desktop/orinoco-usb-0.2.2/driver/hermes.h:462: warning: passing argument 2 of ‘writew’ makes pointer from integer without a cast
/home/ubuntu/Desktop/orinoco-usb-0.2.2/driver/orinoco.c: At top level:
/home/ubuntu/Desktop/orinoco-usb-0.2.2/driver/orinoco.c:462: error: expected ‘)’ before string constant
/home/ubuntu/Desktop/orinoco-usb-0.2.2/driver/orinoco.c:467: error: expected ‘)’ before string constant
/home/ubuntu/Desktop/orinoco-usb-0.2.2/driver/orinoco.c: In function ‘__orinoco_down’:
/home/ubuntu/Desktop/orinoco-usb-0.2.2/driver/orinoco.c:631: warning: passing argument 2 of ‘writew’ makes pointer from integer without a cast
/home/ubuntu/Desktop/orinoco-usb-0.2.2/driver/orinoco.c: In function ‘orinoco_reset’:
/home/ubuntu/Desktop/orinoco-usb-0.2.2/driver/orinoco.c:972: warning: passing argument 2 of ‘writew’ makes pointer from integer without a cast
/home/ubuntu/Desktop/orinoco-usb-0.2.2/driver/orinoco.c: In function ‘orinoco_interrupt’:
/home/ubuntu/Desktop/orinoco-usb-0.2.2/driver/orinoco.c:1440: warning: passing argument 1 of ‘readw’ makes pointer from integer without a cast
/home/ubuntu/Desktop/orinoco-usb-0.2.2/driver/orinoco.c:1484: warning: passing argument 2 of ‘writew’ makes pointer from integer without a cast
/home/ubuntu/Desktop/orinoco-usb-0.2.2/driver/orinoco.c:1486: warning: passing argument 1 of ‘readw’ makes pointer from integer without a cast
/home/ubuntu/Desktop/orinoco-usb-0.2.2/driver/orinoco.c: In function ‘__orinoco_ev_info’:
/home/ubuntu/Desktop/orinoco-usb-0.2.2/driver/orinoco.c:1564: warning: passing argument 1 of ‘readw’ makes pointer from integer without a cast
/home/ubuntu/Desktop/orinoco-usb-0.2.2/driver/orinoco.c: In function ‘__orinoco_ev_rx’:
/home/ubuntu/Desktop/orinoco-usb-0.2.2/driver/orinoco.c:1664: warning: passing argument 1 of ‘readw’ makes pointer from integer without a cast
/home/ubuntu/Desktop/orinoco-usb-0.2.2/driver/orinoco.c: In function ‘__orinoco_ev_txexc’:
/home/ubuntu/Desktop/orinoco-usb-0.2.2/driver/orinoco.c:1806: warning: passing argument 1 of ‘readw’ makes pointer from integer without a cast
/home/ubuntu/Desktop/orinoco-usb-0.2.2/driver/orinoco.c:1825: warning: passing argument 2 of ‘writew’ makes pointer from integer without a cast
/home/ubuntu/Desktop/orinoco-usb-0.2.2/driver/orinoco.c: In function ‘__orinoco_ev_tx’:
/home/ubuntu/Desktop/orinoco-usb-0.2.2/driver/orinoco.c:1835: warning: passing argument 2 of ‘writew’ makes pointer from integer without a cast
/home/ubuntu/Desktop/orinoco-usb-0.2.2/driver/orinoco.c: In function ‘__orinoco_ev_alloc’:
/home/ubuntu/Desktop/orinoco-usb-0.2.2/driver/orinoco.c:1842: warning: passing argument 1 of ‘readw’ makes pointer from integer without a cast
/home/ubuntu/Desktop/orinoco-usb-0.2.2/driver/orinoco.c:1853: warning: passing argument 2 of ‘writew’ makes pointer from integer without a cast
/home/ubuntu/Desktop/orinoco-usb-0.2.2/driver/orinoco.c: In function ‘orinoco_tx_timeout’:
/home/ubuntu/Desktop/orinoco-usb-0.2.2/driver/orinoco.c:2443: warning: passing argument 1 of ‘readw’ makes pointer from integer without a cast
/home/ubuntu/Desktop/orinoco-usb-0.2.2/driver/orinoco.c:2444: warning: passing argument 1 of ‘readw’ makes pointer from integer without a cast
/home/ubuntu/Desktop/orinoco-usb-0.2.2/driver/orinoco.c:2444: warning: passing argument 1 of ‘readw’ makes pointer from integer without a cast
/home/ubuntu/Desktop/orinoco-usb-0.2.2/driver/orinoco.c: In function ‘orinoco_ioctl_getiwrange’:
/home/ubuntu/Desktop/orinoco-usb-0.2.2/driver/orinoco.c:2552: warning: implicit declaration of function ‘verify_area’
make[3]: *** [/home/ubuntu/Desktop/orinoco-usb-0.2.2/driver/orinoco.o] Error 1
make[2]: *** [_module_/home/ubuntu/Desktop/orinoco-usb-0.2.2/driver] Error 2
make[2]: Leaving directory `/usr/src/linux-headers-2.6.17-10-generic'
make[1]: *** [modules] Error 2
make[1]: Leaving directory `/home/ubuntu/Desktop/orinoco-usb-0.2.2/driver'
make: *** [all] Error 2