sean@Noodle:~/Desktop/orinoco-usb-0.2.2$ sudo make
make -C driver
make[1]: Entering directory `/home/sean/Desktop/orinoco-usb-0.2.2/driver'
mkdir -p .tmp_versions
cp /lib/modules/2.6.20-14-generic/build/.tmp_versions/*.mod /home/sean/Desktop/orinoco-usb-0.2.2/driver/.tmp_versions
cp: cannot stat `/lib/modules/2.6.20-14-generic/build/.tmp_versions/*.mod': No such file or directory
make[1]: [modules] Error 1 (ignored)
make -C /lib/modules/2.6.20-14-generic/build SUBDIRS=/home/sean/Desktop/orinoco-usb-0.2.2/driver MODVERDIR=/home/sean/Desktop/orinoco-usb-0.2.2/driver/.tmp_versions modules
make[2]: Entering directory `/usr/src/linux-headers-2.6.20-14-generic'
CC [M] /home/sean/Desktop/orinoco-usb-0.2.2/driver/orinoco.o
In file included from /home/sean/Desktop/orinoco-usb-0.2.2/driver/orinoco.c:445:
/home/sean/Desktop/orinoco-usb-0.2.2/driver/hermes.h: In function hermes_present:
/home/sean/Desktop/orinoco-usb-0.2.2/driver/hermes.h:379: warning: passing argument 1 of readw makes pointer from integer without a cast
/home/sean/Desktop/orinoco-usb-0.2.2/driver/hermes.h: In function hermes_set_irqmask:
/home/sean/Desktop/orinoco-usb-0.2.2/driver/hermes.h:385: warning: passing argument 2 of writew makes pointer from integer without a cast
/home/sean/Desktop/orinoco-usb-0.2.2/driver/hermes.h: In function hermes_read_words:
/home/sean/Desktop/orinoco-usb-0.2.2/driver/hermes.h:426: warning: passing argument 1 of readw makes pointer from integer without a cast
/home/sean/Desktop/orinoco-usb-0.2.2/driver/hermes.h: In function hermes_write_words:
/home/sean/Desktop/orinoco-usb-0.2.2/driver/hermes.h:446: warning: passing argument 2 of writew makes pointer from integer without a cast
/home/sean/Desktop/orinoco-usb-0.2.2/driver/hermes.h: In function hermes_clear_words:
/home/sean/Desktop/orinoco-usb-0.2.2/driver/hermes.h:462: warning: passing argument 2 of writew makes pointer from integer without a cast
/home/sean/Desktop/orinoco-usb-0.2.2/driver/orinoco.c: At top level:
/home/sean/Desktop/orinoco-usb-0.2.2/driver/orinoco.c:463: error: expected ) before string constant
/home/sean/Desktop/orinoco-usb-0.2.2/driver/orinoco.c:468: error: expected ) before string constant
/home/sean/Desktop/orinoco-usb-0.2.2/driver/orinoco.c: In function __orinoco_down:
/home/sean/Desktop/orinoco-usb-0.2.2/driver/orinoco.c:632: warning: passing argument 2 of writew makes pointer from integer without a cast
/home/sean/Desktop/orinoco-usb-0.2.2/driver/orinoco.c: In function orinoco_reset:
/home/sean/Desktop/orinoco-usb-0.2.2/driver/orinoco.c:973: warning: passing argument 2 of writew makes pointer from integer without a cast
/home/sean/Desktop/orinoco-usb-0.2.2/driver/orinoco.c: In function orinoco_interrupt:
/home/sean/Desktop/orinoco-usb-0.2.2/driver/orinoco.c:1441: warning: passing argument 1 of readw makes pointer from integer without a cast
/home/sean/Desktop/orinoco-usb-0.2.2/driver/orinoco.c:1485: warning: passing argument 2 of writew makes pointer from integer without a cast
/home/sean/Desktop/orinoco-usb-0.2.2/driver/orinoco.c:1487: warning: passing argument 1 of readw makes pointer from integer without a cast
/home/sean/Desktop/orinoco-usb-0.2.2/driver/orinoco.c: In function __orinoco_ev_info:
/home/sean/Desktop/orinoco-usb-0.2.2/driver/orinoco.c:1565: warning: passing argument 1 of readw makes pointer from integer without a cast
/home/sean/Desktop/orinoco-usb-0.2.2/driver/orinoco.c: In function __orinoco_ev_rx:
/home/sean/Desktop/orinoco-usb-0.2.2/driver/orinoco.c:1665: warning: passing argument 1 of readw makes pointer from integer without a cast
/home/sean/Desktop/orinoco-usb-0.2.2/driver/orinoco.c: In function __orinoco_ev_txexc:
/home/sean/Desktop/orinoco-usb-0.2.2/driver/orinoco.c:1807: warning: passing argument 1 of readw makes pointer from integer without a cast
/home/sean/Desktop/orinoco-usb-0.2.2/driver/orinoco.c:1826: warning: passing argument 2 of writew makes pointer from integer without a cast
/home/sean/Desktop/orinoco-usb-0.2.2/driver/orinoco.c: In function __orinoco_ev_tx:
/home/sean/Desktop/orinoco-usb-0.2.2/driver/orinoco.c:1836: warning: passing argument 2 of writew makes pointer from integer without a cast
/home/sean/Desktop/orinoco-usb-0.2.2/driver/orinoco.c: In function __orinoco_ev_alloc:
/home/sean/Desktop/orinoco-usb-0.2.2/driver/orinoco.c:1843: warning: passing argument 1 of readw makes pointer from integer without a cast
/home/sean/Desktop/orinoco-usb-0.2.2/driver/orinoco.c:1854: warning: passing argument 2 of writew makes pointer from integer without a cast
/home/sean/Desktop/orinoco-usb-0.2.2/driver/orinoco.c: In function orinoco_tx_timeout:
/home/sean/Desktop/orinoco-usb-0.2.2/driver/orinoco.c:2444: warning: passing argument 1 of readw makes pointer from integer without a cast
/home/sean/Desktop/orinoco-usb-0.2.2/driver/orinoco.c:2445: warning: passing argument 1 of readw makes pointer from integer without a cast
/home/sean/Desktop/orinoco-usb-0.2.2/driver/orinoco.c:2445: warning: passing argument 1 of readw makes pointer from integer without a cast
/home/sean/Desktop/orinoco-usb-0.2.2/driver/orinoco.c: In function orinoco_ioctl_getiwrange:
/home/sean/Desktop/orinoco-usb-0.2.2/driver/orinoco.c:2553: warning: implicit declaration of function verify_area
/home/sean/Desktop/orinoco-usb-0.2.2/driver/orinoco.c: In function alloc_orinoco_netdev:
/home/sean/Desktop/orinoco-usb-0.2.2/driver/orinoco.c:4135: error: struct net_device has no member named get_wireless_stats
/home/sean/Desktop/orinoco-usb-0.2.2/driver/orinoco.c:4151:67: error: macro "INIT_WORK" passed 3 arguments, but takes just 2
/home/sean/Desktop/orinoco-usb-0.2.2/driver/orinoco.c:4151: error: INIT_WORK undeclared (first use in this function)
/home/sean/Desktop/orinoco-usb-0.2.2/driver/orinoco.c:4151: error: (Each undeclared identifier is reported only once
/home/sean/Desktop/orinoco-usb-0.2.2/driver/orinoco.c:4151: error: for each function it appears in.)
make[3]: *** [/home/sean/Desktop/orinoco-usb-0.2.2/driver/orinoco.o] Error 1
make[2]: *** [_module_/home/sean/Desktop/orinoco-usb-0.2.2/driver] Error 2
make[2]: Leaving directory `/usr/src/linux-headers-2.6.20-14-generic'
make[1]: *** [modules] Error 2
make[1]: Leaving directory `/home/sean/Desktop/orinoco-usb-0.2.2/driver'
make: *** [all] Error 2
sean@Noodle:~/Desktop/orinoco-usb-0.2.2$