rendered paste bodytruecrypt-4.1-source-code/Linux# ./build.sh
Checking build requirements...
Building kernel module... /usr/lib/gcc/armeb-linux/3.4.4/../../../../armeb-linux/bin/ld: Warning: /tmp/ccpHsHlz.o does not support interworking, whereas /home/kami/source/truecrypt-4.1-source-code/Linux/Kernel/../../Linux/Common/platform does
scripts/basic/fixdep: 1: Syntax error: "(" unexpected
make[2]: *** [/home/kami/source/truecrypt-4.1-source-code/Linux/Kernel/../../Crypto/Aescrypt.o] Error 2
make[1]: *** [_module_/home/kami/source/truecrypt-4.1-source-code/Linux/Kernel] Error 2
make: *** [truecrypt] Error 2
Error: Failed to build kernel module