All pastes #431339 Raw Edit

Stuff

public text v1 · immutable
·published 2007-04-09 16:27 UTC
rendered paste body
sysdeputil.c:109: error: expected declaration specifiers or ‘...’ before ‘header’
sysdeputil.c:109: error: expected declaration specifiers or ‘...’ before ‘data’
In file included from sysdeputil.c:116:
/usr/include/sys/sendfile.h: In function ‘_syscall2’:
/usr/include/sys/sendfile.h:35: error: storage class specified for parameter ‘sendfile’
sysdeputil.c:132: error: storage class specified for parameter ‘environ’
sysdeputil.c:133: error: storage class specified for parameter ‘s_proctitle_space’
sysdeputil.c:133: error: parameter ‘s_proctitle_space’ is initialized
sysdeputil.c:134: error: storage class specified for parameter ‘s_proctitle_inited’
sysdeputil.c:134: error: parameter ‘s_proctitle_inited’ is initialized
sysdeputil.c:135: error: storage class specified for parameter ‘s_p_proctitle’
sysdeputil.c:135: error: parameter ‘s_p_proctitle’ is initialized
sysdeputil.c:147: error: storage class specified for parameter ‘do_sendfile’
sysdeputil.c:148: error: storage class specified for parameter ‘vsf_sysutil_setproctitle_internal’
sysdeputil.c:149: error: storage class specified for parameter ‘s_proctitle_prefix_str’
sysdeputil.c:216: error: storage class specified for parameter ‘s_pword_str’
sysdeputil.c:218: error: storage class specified for parameter ‘pam_conv_func’
sysdeputil.c:224: error: expected ‘=’, ‘,’, ‘;’, ‘asm’ or ‘__attribute__’ before ‘{’ token
sysdeputil.c:278: error: expected ‘=’, ‘,’, ‘;’, ‘asm’ or ‘__attribute__’ before ‘{’ token
sysdeputil.c:322: error: expected ‘=’, ‘,’, ‘;’, ‘asm’ or ‘__attribute__’ before ‘{’ token
sysdeputil.c:362: error: expected ‘=’, ‘,’, ‘;’, ‘asm’ or ‘__attribute__’ before ‘{’ token
sysdeputil.c:384: error: expected ‘=’, ‘,’, ‘;’, ‘asm’ or ‘__attribute__’ before ‘{’ token
sysdeputil.c:403: error: expected ‘=’, ‘,’, ‘;’, ‘asm’ or ‘__attribute__’ before ‘{’ token
sysdeputil.c:440: error: expected ‘=’, ‘,’, ‘;’, ‘asm’ or ‘__attribute__’ before ‘{’ token
sysdeputil.c:481: error: expected ‘=’, ‘,’, ‘;’, ‘asm’ or ‘__attribute__’ before ‘{’ token
sysdeputil.c:591: error: expected ‘=’, ‘,’, ‘;’, ‘asm’ or ‘__attribute__’ before ‘{’ token
sysdeputil.c:598: error: expected ‘=’, ‘,’, ‘;’, ‘asm’ or ‘__attribute__’ before ‘{’ token
sysdeputil.c:604: error: expected ‘=’, ‘,’, ‘;’, ‘asm’ or ‘__attribute__’ before ‘{’ token
sysdeputil.c:651: error: expected ‘=’, ‘,’, ‘;’, ‘asm’ or ‘__attribute__’ before ‘{’ token
sysdeputil.c:684: error: expected ‘=’, ‘,’, ‘;’, ‘asm’ or ‘__attribute__’ before ‘{’ token
sysdeputil.c:725: error: expected ‘=’, ‘,’, ‘;’, ‘asm’ or ‘__attribute__’ before ‘{’ token
sysdeputil.c:730: error: expected ‘=’, ‘,’, ‘;’, ‘asm’ or ‘__attribute__’ before ‘{’ token
sysdeputil.c:771: error: expected ‘=’, ‘,’, ‘;’, ‘asm’ or ‘__attribute__’ before ‘{’ token
sysdeputil.c:807: error: expected ‘=’, ‘,’, ‘;’, ‘asm’ or ‘__attribute__’ before ‘{’ token
sysdeputil.c:848: error: old-style parameter declarations in prototyped function definition
sysdeputil.c:109: error: parameter name omitted
sysdeputil.c:109: error: parameter name omitted
sysdeputil.c:109: error: parameter name omitted
sysdeputil.c:848: error: expected ‘{’ at end of input
make: *** [sysdeputil.o] Error 1