All pastes #431307 Raw Edit

Miscellany

public text v1 · immutable
·published 2007-04-09 16:11 UTC
rendered paste body
/usr/include/sys/sendfile.h: In function ‘_syscall2’:
/usr/include/sys/sendfile.h:35: error: storage class specified for parameter ‘sendfile’
sysdeputil.c:186: error: storage class specified for parameter ‘environ’
sysdeputil.c:187: error: storage class specified for parameter ‘s_proctitle_space’
sysdeputil.c:187: error: parameter ‘s_proctitle_space’ is initialized
sysdeputil.c:188: error: storage class specified for parameter ‘s_proctitle_inited’
sysdeputil.c:188: error: parameter ‘s_proctitle_inited’ is initialized
sysdeputil.c:189: error: storage class specified for parameter ‘s_p_proctitle’
sysdeputil.c:189: error: parameter ‘s_p_proctitle’ is initialized
sysdeputil.c:201: error: storage class specified for parameter ‘do_sendfile’
sysdeputil.c:202: error: storage class specified for parameter ‘vsf_sysutil_setproctitle_internal’
sysdeputil.c:203: error: storage class specified for parameter ‘s_proctitle_prefix_str’
sysdeputil.c:215: error: expected ‘=’, ‘,’, ‘;’, ‘asm’ or ‘__attribute__’ before ‘{’ token
sysdeputil.c:436: error: expected ‘=’, ‘,’, ‘;’, ‘asm’ or ‘__attribute__’ before ‘{’ token
sysdeputil.c:474: error: storage class specified for parameter ‘do_checkcap’
sysdeputil.c:478: error: expected ‘=’, ‘,’, ‘;’, ‘asm’ or ‘__attribute__’ before ‘{’ token
sysdeputil.c:497: error: expected ‘=’, ‘,’, ‘;’, ‘asm’ or ‘__attribute__’ before ‘{’ token
sysdeputil.c:514: error: expected ‘=’, ‘,’, ‘;’, ‘asm’ or ‘__attribute__’ before ‘{’ token
sysdeputil.c:527: error: expected ‘=’, ‘,’, ‘;’, ‘asm’ or ‘__attribute__’ before ‘{’ token
sysdeputil.c:604: error: expected ‘=’, ‘,’, ‘;’, ‘asm’ or ‘__attribute__’ before ‘{’ token
sysdeputil.c:641: error: expected ‘=’, ‘,’, ‘;’, ‘asm’ or ‘__attribute__’ before ‘{’ token
sysdeputil.c:796: error: expected ‘=’, ‘,’, ‘;’, ‘asm’ or ‘__attribute__’ before ‘{’ token
sysdeputil.c:803: error: expected ‘=’, ‘,’, ‘;’, ‘asm’ or ‘__attribute__’ before ‘{’ token
sysdeputil.c:809: error: expected ‘=’, ‘,’, ‘;’, ‘asm’ or ‘__attribute__’ before ‘{’ token
sysdeputil.c:856: error: expected ‘=’, ‘,’, ‘;’, ‘asm’ or ‘__attribute__’ before ‘{’ token
sysdeputil.c:889: error: expected ‘=’, ‘,’, ‘;’, ‘asm’ or ‘__attribute__’ before ‘{’ token
sysdeputil.c:930: error: expected ‘=’, ‘,’, ‘;’, ‘asm’ or ‘__attribute__’ before ‘{’ token
sysdeputil.c:935: error: expected ‘=’, ‘,’, ‘;’, ‘asm’ or ‘__attribute__’ before ‘{’ token
sysdeputil.c:976: error: expected ‘=’, ‘,’, ‘;’, ‘asm’ or ‘__attribute__’ before ‘{’ token
sysdeputil.c:1012: error: expected ‘=’, ‘,’, ‘;’, ‘asm’ or ‘__attribute__’ before ‘{’ token
sysdeputil.c:1128: error: storage class specified for parameter ‘s_uwtmp_inserted’
sysdeputil.c:1129: error: storage class specified for parameter ‘s_utent’
sysdeputil.c:1134: error: expected ‘=’, ‘,’, ‘;’, ‘asm’ or ‘__attribute__’ before ‘{’ token
sysdeputil.c:1173: error: expected ‘=’, ‘,’, ‘;’, ‘asm’ or ‘__attribute__’ before ‘{’ token
sysdeputil.c:1189: error: old-style parameter declarations in prototyped function definition
sysdeputil.c:162: error: parameter name omitted
sysdeputil.c:162: error: parameter name omitted
sysdeputil.c:162: error: parameter name omitted
sysdeputil.c:1189: error: expected ‘{’ at end of input
make: *** [sysdeputil.o] Error 1