All pastes #431101 Raw Edit

Someone

public text v1 · immutable
·published 2007-04-09 13:26 UTC
rendered paste body
CPAN: File::HomeDir loaded ok (v0.64)
CPAN: Storable loaded ok (v2.15)
CPAN: LWP::UserAgent loaded ok (v2.033)
Fetching with LWP:
  ftp://cpan.uchicago.edu/pub/CPAN/authors/01mailrc.txt.gz
CPAN: YAML loaded ok (v0.62)
Going to read /root/.cpan/sources/authors/01mailrc.txt.gz
............................................................................DONE
Fetching with LWP:
  ftp://cpan.uchicago.edu/pub/CPAN/modules/02packages.details.txt.gz
Going to read /root/.cpan/sources/modules/02packages.details.txt.gz
  Database was generated on Mon, 09 Apr 2007 06:08:45 GMT
............................................................................DONE
Fetching with LWP:
  ftp://cpan.uchicago.edu/pub/CPAN/modules/03modlist.data.gz
Going to read /root/.cpan/sources/modules/03modlist.data.gz
............................................................................DONE
Going to write /root/.cpan/Metadata
Fetching with LWP:
  ftp://cpan.uchicago.edu/pub/CPAN/authors/id/A/AN/ANDK/Bundle-CPAN-1.855.tar.gz
CPAN: Digest::SHA loaded ok (v5.44)
Fetching with LWP:
  ftp://cpan.uchicago.edu/pub/CPAN/authors/id/A/AN/ANDK/CHECKSUMS
Checksum for /root/.cpan/sources/authors/id/A/AN/ANDK/Bundle-CPAN-1.855.tar.gz ok
Bundle-CPAN-1.855/
Bundle-CPAN-1.855/MANIFEST
Bundle-CPAN-1.855/META.yml
Bundle-CPAN-1.855/MANIFEST.SKIP
Bundle-CPAN-1.855/CPANxxl.pm
Bundle-CPAN-1.855/CPAN.pm
Bundle-CPAN-1.855/t/
Bundle-CPAN-1.855/t/00signature.t
Bundle-CPAN-1.855/SIGNATURE
Bundle-CPAN-1.855/Makefile.PL
CPAN: File::Temp loaded ok (v0.18)
Test::Harness is up to date (2.64).
ExtUtils::CBuilder is up to date (0.18).
Running install for module 'Module::Build'
Running make for K/KW/KWILLIAMS/Module-Build-0.2807.tar.gz
Fetching with LWP:
  ftp://cpan.uchicago.edu/pub/CPAN/authors/id/K/KW/KWILLIAMS/Module-Build-0.2807.tar.gz
Fetching with LWP:
  ftp://cpan.uchicago.edu/pub/CPAN/authors/id/K/KW/KWILLIAMS/CHECKSUMS
Checksum for /root/.cpan/sources/authors/id/K/KW/KWILLIAMS/Module-Build-0.2807.tar.gz ok
Module-Build-0.2807/
Module-Build-0.2807/Build.PL
Module-Build-0.2807/Changes
Module-Build-0.2807/contrib/
Module-Build-0.2807/contrib/bash_completion.module-build
Module-Build-0.2807/INSTALL
Module-Build-0.2807/lib/
Module-Build-0.2807/lib/Module/
Module-Build-0.2807/lib/Module/Build/
Module-Build-0.2807/lib/Module/Build/API.pod
Module-Build-0.2807/lib/Module/Build/Authoring.pod
Module-Build-0.2807/lib/Module/Build/Base.pm
Module-Build-0.2807/lib/Module/Build/Compat.pm
Module-Build-0.2807/lib/Module/Build/Config.pm
Module-Build-0.2807/lib/Module/Build/Cookbook.pm
Module-Build-0.2807/lib/Module/Build/ModuleInfo.pm
Module-Build-0.2807/lib/Module/Build/Notes.pm
Module-Build-0.2807/lib/Module/Build/Platform/
Module-Build-0.2807/lib/Module/Build/Platform/aix.pm
Module-Build-0.2807/lib/Module/Build/Platform/Amiga.pm
Module-Build-0.2807/lib/Module/Build/Platform/cygwin.pm
Module-Build-0.2807/lib/Module/Build/Platform/darwin.pm
Module-Build-0.2807/lib/Module/Build/Platform/Default.pm
Module-Build-0.2807/lib/Module/Build/Platform/EBCDIC.pm
Module-Build-0.2807/lib/Module/Build/Platform/MacOS.pm
Module-Build-0.2807/lib/Module/Build/Platform/MPEiX.pm
Module-Build-0.2807/lib/Module/Build/Platform/os2.pm
Module-Build-0.2807/lib/Module/Build/Platform/RiscOS.pm
Module-Build-0.2807/lib/Module/Build/Platform/Unix.pm
Module-Build-0.2807/lib/Module/Build/Platform/VMS.pm
Module-Build-0.2807/lib/Module/Build/Platform/VOS.pm
Module-Build-0.2807/lib/Module/Build/Platform/Windows.pm
Module-Build-0.2807/lib/Module/Build/PodParser.pm
Module-Build-0.2807/lib/Module/Build/PPMMaker.pm
Module-Build-0.2807/lib/Module/Build/Version.pm
Module-Build-0.2807/lib/Module/Build/YAML.pm
Module-Build-0.2807/lib/Module/Build.pm
Module-Build-0.2807/Makefile.PL
Module-Build-0.2807/MANIFEST
Module-Build-0.2807/META.yml
Module-Build-0.2807/README
Module-Build-0.2807/scripts/
Module-Build-0.2807/scripts/config_data
Module-Build-0.2807/SIGNATURE
Module-Build-0.2807/t/
Module-Build-0.2807/t/basic.t
Module-Build-0.2807/t/bundled/
Module-Build-0.2807/t/bundled/Test/
Module-Build-0.2807/t/bundled/Test/Builder.pm
Module-Build-0.2807/t/bundled/Test/More.pm
Module-Build-0.2807/t/bundled/Test/Simple.pm
Module-Build-0.2807/t/bundled/Tie/
Module-Build-0.2807/t/bundled/Tie/CPHash.pm
Module-Build-0.2807/t/compat.t
Module-Build-0.2807/t/destinations.t
Module-Build-0.2807/t/ext.t
Module-Build-0.2807/t/extend.t
Module-Build-0.2807/t/files.t
Module-Build-0.2807/t/install.t
Module-Build-0.2807/t/lib/
Module-Build-0.2807/t/lib/DistGen.pm
Module-Build-0.2807/t/lib/MBTest.pm
Module-Build-0.2807/t/manifypods.t
Module-Build-0.2807/t/mbyaml.t
Module-Build-0.2807/t/metadata.t
Module-Build-0.2807/t/metadata2.t
Module-Build-0.2807/t/moduleinfo.t
Module-Build-0.2807/t/new_from_context.t
Module-Build-0.2807/t/notes.t
Module-Build-0.2807/t/par.t
Module-Build-0.2807/t/parents.t
Module-Build-0.2807/t/pod_parser.t
Module-Build-0.2807/t/ppm.t
Module-Build-0.2807/t/runthrough.t
Module-Build-0.2807/t/signature.t
Module-Build-0.2807/t/test_type.t
Module-Build-0.2807/t/test_types.t
Module-Build-0.2807/t/tilde.t
Module-Build-0.2807/t/versions.t
Module-Build-0.2807/t/xs.t
CPAN: Module::Build loaded ok (v0.2805)

  CPAN.pm: Going to build K/KW/KWILLIAMS/Module-Build-0.2807.tar.gz

# running Build.PL
/usr/bin/perl5.8.8 Build.PL
Checking whether your kit is complete...
Looks good

Checking prerequisites...
Looks good

Checking features:
  manpage_support....enabled
  YAML_support.......enabled
  C_support..........enabled
  HTML_support.......enabled

Creating new 'Build' script for 'Module-Build' version '0.2807'
/usr/bin/perl5.8.8 Build --makefile_env_macros 1
Copying lib/Module/Build/Version.pm -> blib/lib/Module/Build/Version.pm
Copying lib/Module/Build/Platform/darwin.pm -> blib/lib/Module/Build/Platform/darwin.pm
Copying lib/Module/Build/Platform/MacOS.pm -> blib/lib/Module/Build/Platform/MacOS.pm
Copying lib/Module/Build/Notes.pm -> blib/lib/Module/Build/Notes.pm
Copying lib/Module/Build/Compat.pm -> blib/lib/Module/Build/Compat.pm
Copying lib/Module/Build/Platform/RiscOS.pm -> blib/lib/Module/Build/Platform/RiscOS.pm
Copying lib/Module/Build/PodParser.pm -> blib/lib/Module/Build/PodParser.pm
Copying lib/Module/Build/Platform/VOS.pm -> blib/lib/Module/Build/Platform/VOS.pm
Copying lib/Module/Build/Platform/Windows.pm -> blib/lib/Module/Build/Platform/Windows.pm
Copying lib/Module/Build/Platform/Unix.pm -> blib/lib/Module/Build/Platform/Unix.pm
Copying lib/Module/Build/ModuleInfo.pm -> blib/lib/Module/Build/ModuleInfo.pm
Copying lib/Module/Build/Platform/Amiga.pm -> blib/lib/Module/Build/Platform/Amiga.pm
Copying lib/Module/Build/Config.pm -> blib/lib/Module/Build/Config.pm
Copying lib/Module/Build/Platform/os2.pm -> blib/lib/Module/Build/Platform/os2.pm
Copying lib/Module/Build/Base.pm -> blib/lib/Module/Build/Base.pm
Copying lib/Module/Build/Platform/VMS.pm -> blib/lib/Module/Build/Platform/VMS.pm
Copying lib/Module/Build/Platform/MPEiX.pm -> blib/lib/Module/Build/Platform/MPEiX.pm
Copying lib/Module/Build/Platform/cygwin.pm -> blib/lib/Module/Build/Platform/cygwin.pm
Copying lib/Module/Build/Platform/EBCDIC.pm -> blib/lib/Module/Build/Platform/EBCDIC.pm
Copying lib/Module/Build.pm -> blib/lib/Module/Build.pm
Copying lib/Module/Build/PPMMaker.pm -> blib/lib/Module/Build/PPMMaker.pm
Copying lib/Module/Build/Platform/aix.pm -> blib/lib/Module/Build/Platform/aix.pm
Copying lib/Module/Build/Cookbook.pm -> blib/lib/Module/Build/Cookbook.pm
Copying lib/Module/Build/Platform/Default.pm -> blib/lib/Module/Build/Platform/Default.pm
Copying lib/Module/Build/YAML.pm -> blib/lib/Module/Build/YAML.pm
Copying lib/Module/Build/Authoring.pod -> blib/lib/Module/Build/Authoring.pod
Copying lib/Module/Build/API.pod -> blib/lib/Module/Build/API.pod
Copying scripts/config_data -> blib/script/config_data
Deleting blib/script/config_data.bak
Writing config notes to blib/lib/Module/Build/ConfigData.pm
Manifying blib/script/config_data -> blib/bindoc/config_data.1
Manifying blib/lib/Module/Build/Platform/Unix.pm -> blib/libdoc/Module::Build::Platform::Unix.3pm
Manifying blib/lib/Module/Build/Platform/EBCDIC.pm -> blib/libdoc/Module::Build::Platform::EBCDIC.3pm
Manifying blib/lib/Module/Build/Platform/MacOS.pm -> blib/libdoc/Module::Build::Platform::MacOS.3pm
Manifying blib/lib/Module/Build.pm -> blib/libdoc/Module::Build.3pm
Manifying blib/lib/Module/Build/Platform/Amiga.pm -> blib/libdoc/Module::Build::Platform::Amiga.3pm
Manifying blib/lib/Module/Build/ConfigData.pm -> blib/libdoc/Module::Build::ConfigData.3pm
Manifying blib/lib/Module/Build/Platform/cygwin.pm -> blib/libdoc/Module::Build::Platform::cygwin.3pm
Manifying blib/lib/Module/Build/Notes.pm -> blib/libdoc/Module::Build::Notes.3pm
Manifying blib/lib/Module/Build/ModuleInfo.pm -> blib/libdoc/Module::Build::ModuleInfo.3pm
Manifying blib/lib/Module/Build/YAML.pm -> blib/libdoc/Module::Build::YAML.3pm
Manifying blib/lib/Module/Build/Platform/MPEiX.pm -> blib/libdoc/Module::Build::Platform::MPEiX.3pm
Manifying blib/lib/Module/Build/PPMMaker.pm -> blib/libdoc/Module::Build::PPMMaker.3pm
Manifying blib/lib/Module/Build/Platform/Windows.pm -> blib/libdoc/Module::Build::Platform::Windows.3pm
Manifying blib/lib/Module/Build/Platform/VOS.pm -> blib/libdoc/Module::Build::Platform::VOS.3pm
Manifying blib/lib/Module/Build/Platform/Default.pm -> blib/libdoc/Module::Build::Platform::Default.3pm
Manifying blib/lib/Module/Build/API.pod -> blib/libdoc/Module::Build::API.3pm
Manifying blib/lib/Module/Build/Platform/RiscOS.pm -> blib/libdoc/Module::Build::Platform::RiscOS.3pm
Manifying blib/lib/Module/Build/Cookbook.pm -> blib/libdoc/Module::Build::Cookbook.3pm
Manifying blib/lib/Module/Build/Platform/aix.pm -> blib/libdoc/Module::Build::Platform::aix.3pm
Manifying blib/lib/Module/Build/Platform/darwin.pm -> blib/libdoc/Module::Build::Platform::darwin.3pm
Manifying blib/lib/Module/Build/Platform/os2.pm -> blib/libdoc/Module::Build::Platform::os2.3pm
Manifying blib/lib/Module/Build/Platform/VMS.pm -> blib/libdoc/Module::Build::Platform::VMS.3pm
Manifying blib/lib/Module/Build/Base.pm -> blib/libdoc/Module::Build::Base.3pm
Manifying blib/lib/Module/Build/Authoring.pod -> blib/libdoc/Module::Build::Authoring.3pm
Manifying blib/lib/Module/Build/Compat.pm -> blib/libdoc/Module::Build::Compat.3pm
  KWILLIAMS/Module-Build-0.2807.tar.gz
  /usr/bin/make PREFIX=~/perlmodules PREFIX=~/perlmodules -- OK
Running make test
/usr/bin/perl5.8.8 Build --makefile_env_macros 1 test
t/basic...............ok
t/compat..............ok
t/destinations........ok
        8/113 skipped: various reasons
t/ext.................ok
t/extend..............ok
t/files...............ok
t/install.............ok
t/manifypods..........ok
t/mbyaml..............ok
t/metadata............ok
t/metadata2...........ok
t/moduleinfo..........ok
t/new_from_context....ok
t/notes...............ok
t/par.................skipped
        all skipped: PAR::Dist 0.17 or up not installed to check .par's.
t/parents.............ok
t/pod_parser..........ok
t/ppm.................Use of uninitialized value in concatenation (.) or string at /usr/lib/perl5/5.8.8/i686-linux/Scalar/Util.pm line 30.
t/ppm.................ok
t/runthrough..........ok
        4/32 skipped: various reasons
t/signature...........skipped
        all skipped: $ENV{TEST_SIGNATURE} is not set
t/test_type...........ok
t/test_types..........ok
t/tilde...............ok
t/versions............ok
t/xs..................ok
All tests successful, 2 tests and 12 subtests skipped.
Files=25, Tests=753, 50 wallclock secs (27.80 cusr +  6.74 csys = 34.54 CPU)
  KWILLIAMS/Module-Build-0.2807.tar.gz
  /usr/bin/make test -- OK
Running make install
/usr/bin/perl5.8.8 Build --makefile_env_macros 1 install
Skipping /usr/share/man/man1/config_data.1 (unchanged)
Skipping /usr/lib/perl5/site_perl/5.8.8/Module/Build.pm (unchanged)
Skipping /usr/lib/perl5/site_perl/5.8.8/Module/Build/Version.pm (unchanged)
Skipping /usr/lib/perl5/site_perl/5.8.8/Module/Build/Notes.pm (unchanged)
Skipping /usr/lib/perl5/site_perl/5.8.8/Module/Build/Compat.pm (unchanged)
Skipping /usr/lib/perl5/site_perl/5.8.8/Module/Build/PodParser.pm (unchanged)
Skipping /usr/lib/perl5/site_perl/5.8.8/Module/Build/ModuleInfo.pm (unchanged)
Skipping /usr/lib/perl5/site_perl/5.8.8/Module/Build/Config.pm (unchanged)
Skipping /usr/lib/perl5/site_perl/5.8.8/Module/Build/Base.pm (unchanged)
Skipping /usr/lib/perl5/site_perl/5.8.8/Module/Build/PPMMaker.pm (unchanged)
Skipping /usr/lib/perl5/site_perl/5.8.8/Module/Build/Cookbook.pm (unchanged)
Skipping /usr/lib/perl5/site_perl/5.8.8/Module/Build/YAML.pm (unchanged)
Skipping /usr/lib/perl5/site_perl/5.8.8/Module/Build/Authoring.pod (unchanged)
Skipping /usr/lib/perl5/site_perl/5.8.8/Module/Build/API.pod (unchanged)
Skipping /usr/lib/perl5/site_perl/5.8.8/Module/Build/ConfigData.pm (unchanged)
Skipping /usr/lib/perl5/site_perl/5.8.8/Module/Build/Platform/darwin.pm (unchanged)
Skipping /usr/lib/perl5/site_perl/5.8.8/Module/Build/Platform/MacOS.pm (unchanged)
Skipping /usr/lib/perl5/site_perl/5.8.8/Module/Build/Platform/RiscOS.pm (unchanged)
Skipping /usr/lib/perl5/site_perl/5.8.8/Module/Build/Platform/VOS.pm (unchanged)
Skipping /usr/lib/perl5/site_perl/5.8.8/Module/Build/Platform/Windows.pm (unchanged)
Skipping /usr/lib/perl5/site_perl/5.8.8/Module/Build/Platform/Unix.pm (unchanged)
Skipping /usr/lib/perl5/site_perl/5.8.8/Module/Build/Platform/Amiga.pm (unchanged)
Skipping /usr/lib/perl5/site_perl/5.8.8/Module/Build/Platform/os2.pm (unchanged)
Skipping /usr/lib/perl5/site_perl/5.8.8/Module/Build/Platform/VMS.pm (unchanged)
Skipping /usr/lib/perl5/site_perl/5.8.8/Module/Build/Platform/MPEiX.pm (unchanged)
Skipping /usr/lib/perl5/site_perl/5.8.8/Module/Build/Platform/cygwin.pm (unchanged)
Skipping /usr/lib/perl5/site_perl/5.8.8/Module/Build/Platform/EBCDIC.pm (unchanged)
Skipping /usr/lib/perl5/site_perl/5.8.8/Module/Build/Platform/aix.pm (unchanged)
Skipping /usr/lib/perl5/site_perl/5.8.8/Module/Build/Platform/Default.pm (unchanged)
Skipping /usr/share/man/man3/Module::Build::Platform::Unix.3pm (unchanged)
Skipping /usr/share/man/man3/Module::Build::Platform::EBCDIC.3pm (unchanged)
Skipping /usr/share/man/man3/Module::Build::Platform::MacOS.3pm (unchanged)
Skipping /usr/share/man/man3/Module::Build.3pm (unchanged)
Skipping /usr/share/man/man3/Module::Build::Platform::Amiga.3pm (unchanged)
Skipping /usr/share/man/man3/Module::Build::ConfigData.3pm (unchanged)
Skipping /usr/share/man/man3/Module::Build::Platform::cygwin.3pm (unchanged)
Skipping /usr/share/man/man3/Module::Build::Notes.3pm (unchanged)
Skipping /usr/share/man/man3/Module::Build::ModuleInfo.3pm (unchanged)
Skipping /usr/share/man/man3/Module::Build::YAML.3pm (unchanged)
Skipping /usr/share/man/man3/Module::Build::Platform::MPEiX.3pm (unchanged)
Skipping /usr/share/man/man3/Module::Build::PPMMaker.3pm (unchanged)
Skipping /usr/share/man/man3/Module::Build::Platform::Windows.3pm (unchanged)
Skipping /usr/share/man/man3/Module::Build::Platform::VOS.3pm (unchanged)
Skipping /usr/share/man/man3/Module::Build::Platform::Default.3pm (unchanged)
Skipping /usr/share/man/man3/Module::Build::API.3pm (unchanged)
Skipping /usr/share/man/man3/Module::Build::Platform::RiscOS.3pm (unchanged)
Skipping /usr/share/man/man3/Module::Build::Cookbook.3pm (unchanged)
Skipping /usr/share/man/man3/Module::Build::Platform::aix.3pm (unchanged)
Skipping /usr/share/man/man3/Module::Build::Platform::darwin.3pm (unchanged)
Skipping /usr/share/man/man3/Module::Build::Platform::os2.3pm (unchanged)
Skipping /usr/share/man/man3/Module::Build::Platform::VMS.3pm (unchanged)
Skipping /usr/share/man/man3/Module::Build::Base.3pm (unchanged)
Skipping /usr/share/man/man3/Module::Build::Authoring.3pm (unchanged)
Skipping /usr/share/man/man3/Module::Build::Compat.3pm (unchanged)
Skipping /usr/bin/config_data (unchanged)
Writing /usr/lib/perl5/site_perl/5.8.8/i686-linux/auto/Module/Build/.packlist
## Differing version of Module/Build.pm found. You might like to
rm /usr/lib/perl5/vendor_perl/5.8.8/Module/Build.pm
## Differing version of Module/Build/API.pod found. You might like to
rm /usr/lib/perl5/vendor_perl/5.8.8/Module/Build/API.pod
## Differing version of Module/Build/Authoring.pod found. You might like to
rm /usr/lib/perl5/vendor_perl/5.8.8/Module/Build/Authoring.pod
## Differing version of Module/Build/Base.pm found. You might like to
rm /usr/lib/perl5/vendor_perl/5.8.8/Module/Build/Base.pm
## Differing version of Module/Build/Compat.pm found. You might like to
rm /usr/lib/perl5/vendor_perl/5.8.8/Module/Build/Compat.pm
## Differing version of Module/Build/Cookbook.pm found. You might like to
rm /usr/lib/perl5/vendor_perl/5.8.8/Module/Build/Cookbook.pm
## Differing version of Module/Build/ModuleInfo.pm found. You might like to
rm /usr/lib/perl5/vendor_perl/5.8.8/Module/Build/ModuleInfo.pm
## Differing version of Module/Build/PPMMaker.pm found. You might like to
rm /usr/lib/perl5/vendor_perl/5.8.8/Module/Build/PPMMaker.pm
## Differing version of Module/Build/Platform/Amiga.pm found. You might like to
rm /usr/lib/perl5/vendor_perl/5.8.8/Module/Build/Platform/Amiga.pm
## Differing version of Module/Build/Platform/Default.pm found. You might like to
rm /usr/lib/perl5/vendor_perl/5.8.8/Module/Build/Platform/Default.pm
## Differing version of Module/Build/Platform/EBCDIC.pm found. You might like to
rm /usr/lib/perl5/vendor_perl/5.8.8/Module/Build/Platform/EBCDIC.pm
## Differing version of Module/Build/Platform/MPEiX.pm found. You might like to
rm /usr/lib/perl5/vendor_perl/5.8.8/Module/Build/Platform/MPEiX.pm
## Differing version of Module/Build/Platform/MacOS.pm found. You might like to
rm /usr/lib/perl5/vendor_perl/5.8.8/Module/Build/Platform/MacOS.pm
## Differing version of Module/Build/Platform/RiscOS.pm found. You might like to
rm /usr/lib/perl5/vendor_perl/5.8.8/Module/Build/Platform/RiscOS.pm
## Differing version of Module/Build/Platform/Unix.pm found. You might like to
rm /usr/lib/perl5/vendor_perl/5.8.8/Module/Build/Platform/Unix.pm
## Differing version of Module/Build/Platform/VMS.pm found. You might like to
rm /usr/lib/perl5/vendor_perl/5.8.8/Module/Build/Platform/VMS.pm
## Differing version of Module/Build/Platform/VOS.pm found. You might like to
rm /usr/lib/perl5/vendor_perl/5.8.8/Module/Build/Platform/VOS.pm
## Differing version of Module/Build/Platform/Windows.pm found. You might like to
rm /usr/lib/perl5/vendor_perl/5.8.8/Module/Build/Platform/Windows.pm
## Differing version of Module/Build/Platform/aix.pm found. You might like to
rm /usr/lib/perl5/vendor_perl/5.8.8/Module/Build/Platform/aix.pm
## Differing version of Module/Build/Platform/darwin.pm found. You might like to
rm /usr/lib/perl5/vendor_perl/5.8.8/Module/Build/Platform/darwin.pm
## Differing version of Module/Build/Platform/os2.pm found. You might like to
rm /usr/lib/perl5/vendor_perl/5.8.8/Module/Build/Platform/os2.pm
## Differing version of Module/Build/Version.pm found. You might like to
rm /usr/lib/perl5/vendor_perl/5.8.8/Module/Build/Version.pm
## Differing version of Module/Build/YAML.pm found. You might like to
rm /usr/lib/perl5/vendor_perl/5.8.8/Module/Build/YAML.pm
## Running 'make install UNINST=1' will unlink all those files for you.
  KWILLIAMS/Module-Build-0.2807.tar.gz
  /usr/bin/make install  -- OK
File::Spec is up to date (3.24).
File::Temp is up to date (0.18).
Scalar::Util is up to date (1.19).
Running install for module 'Test::More'
Running make for M/MS/MSCHWERN/Test-Simple-0.70.tar.gz
Fetching with LWP:
  ftp://cpan.uchicago.edu/pub/CPAN/authors/id/M/MS/MSCHWERN/Test-Simple-0.70.tar.gz
Fetching with LWP:
  ftp://cpan.uchicago.edu/pub/CPAN/authors/id/M/MS/MSCHWERN/CHECKSUMS
Checksum for /root/.cpan/sources/authors/id/M/MS/MSCHWERN/Test-Simple-0.70.tar.gz ok
Test-Simple-0.70/
Test-Simple-0.70/Changes
Test-Simple-0.70/lib/
Test-Simple-0.70/lib/Test/
Test-Simple-0.70/lib/Test/Builder/
Test-Simple-0.70/lib/Test/Builder/Module.pm
Test-Simple-0.70/lib/Test/Builder/Tester/
Test-Simple-0.70/lib/Test/Builder/Tester/Color.pm
Test-Simple-0.70/lib/Test/Builder/Tester.pm
Test-Simple-0.70/lib/Test/Builder.pm
Test-Simple-0.70/lib/Test/More.pm
Test-Simple-0.70/lib/Test/Simple.pm
Test-Simple-0.70/lib/Test/Tutorial.pod
Test-Simple-0.70/Makefile.PL
Test-Simple-0.70/MANIFEST
Test-Simple-0.70/META.yml
Test-Simple-0.70/README
Test-Simple-0.70/SIGNATURE
Test-Simple-0.70/t/
Test-Simple-0.70/t/00signature.t
Test-Simple-0.70/t/00test_harness_check.t
Test-Simple-0.70/t/bad_plan.t
Test-Simple-0.70/t/bail_out.t
Test-Simple-0.70/t/buffer.t
Test-Simple-0.70/t/Builder.t
Test-Simple-0.70/t/carp.t
Test-Simple-0.70/t/circular_data.t
Test-Simple-0.70/t/create.t
Test-Simple-0.70/t/curr_test.t
Test-Simple-0.70/t/details.t
Test-Simple-0.70/t/diag.t
Test-Simple-0.70/t/eq_set.t
Test-Simple-0.70/t/exit.t
Test-Simple-0.70/t/extra.t
Test-Simple-0.70/t/extra_one.t
Test-Simple-0.70/t/fail-like.t
Test-Simple-0.70/t/fail-more.t
Test-Simple-0.70/t/fail.t
Test-Simple-0.70/t/fail_one.t
Test-Simple-0.70/t/filehandles.t
Test-Simple-0.70/t/fork.t
Test-Simple-0.70/t/harness_active.t
Test-Simple-0.70/t/has_plan.t
Test-Simple-0.70/t/has_plan2.t
Test-Simple-0.70/t/import.t
Test-Simple-0.70/t/is_deeply_fail.t
Test-Simple-0.70/t/is_fh.t
Test-Simple-0.70/t/lib/
Test-Simple-0.70/t/lib/NoExporter.pm
Test-Simple-0.70/t/lib/Test/
Test-Simple-0.70/t/lib/Test/Simple/
Test-Simple-0.70/t/lib/Test/Simple/Catch.pm
Test-Simple-0.70/t/lib/Test/Simple/sample_tests/
Test-Simple-0.70/t/lib/Test/Simple/sample_tests/death.plx
Test-Simple-0.70/t/lib/Test/Simple/sample_tests/death_in_eval.plx
Test-Simple-0.70/t/lib/Test/Simple/sample_tests/exit.plx
Test-Simple-0.70/t/lib/Test/Simple/sample_tests/extras.plx
Test-Simple-0.70/t/lib/Test/Simple/sample_tests/five_fail.plx
Test-Simple-0.70/t/lib/Test/Simple/sample_tests/last_minute_death.plx
Test-Simple-0.70/t/lib/Test/Simple/sample_tests/one_fail.plx
Test-Simple-0.70/t/lib/Test/Simple/sample_tests/pre_plan_death.plx
Test-Simple-0.70/t/lib/Test/Simple/sample_tests/require.plx
Test-Simple-0.70/t/lib/Test/Simple/sample_tests/success.plx
Test-Simple-0.70/t/lib/Test/Simple/sample_tests/too_few.plx
Test-Simple-0.70/t/lib/Test/Simple/sample_tests/too_few_fail.plx
Test-Simple-0.70/t/lib/Test/Simple/sample_tests/two_fail.plx
Test-Simple-0.70/t/lib/TieOut.pm
Test-Simple-0.70/t/maybe_regex.t
Test-Simple-0.70/t/missing.t
Test-Simple-0.70/t/More.t
Test-Simple-0.70/t/no_diag.t
Test-Simple-0.70/t/no_ending.t
Test-Simple-0.70/t/no_header.t
Test-Simple-0.70/t/no_plan.t
Test-Simple-0.70/t/ok_obj.t
Test-Simple-0.70/t/output.t
Test-Simple-0.70/t/overload.t
Test-Simple-0.70/t/overload_threads.t
Test-Simple-0.70/t/plan.t
Test-Simple-0.70/t/plan_bad.t
Test-Simple-0.70/t/plan_is_noplan.t
Test-Simple-0.70/t/plan_no_plan.t
Test-Simple-0.70/t/plan_shouldnt_import.t
Test-Simple-0.70/t/plan_skip_all.t
Test-Simple-0.70/t/pod-coverage.t
Test-Simple-0.70/t/pod.t
Test-Simple-0.70/t/require_ok.t
Test-Simple-0.70/t/reset.t
Test-Simple-0.70/t/simple.t
Test-Simple-0.70/t/skip.t
Test-Simple-0.70/t/skipall.t
Test-Simple-0.70/t/sort_bug.t
Test-Simple-0.70/t/tbt_01basic.t
Test-Simple-0.70/t/tbt_02fhrestore.t
Test-Simple-0.70/t/tbt_03die.t
Test-Simple-0.70/t/tbt_04line_num.t
Test-Simple-0.70/t/tbt_05faildiag.t
Test-Simple-0.70/t/tbt_06errormess.t
Test-Simple-0.70/t/tbt_07args.t
Test-Simple-0.70/t/thread_taint.t
Test-Simple-0.70/t/threads.t
Test-Simple-0.70/t/todo.t
Test-Simple-0.70/t/undef.t
Test-Simple-0.70/t/use_ok.t
Test-Simple-0.70/t/useing.t
Test-Simple-0.70/TODO

  CPAN.pm: Going to build M/MS/MSCHWERN/Test-Simple-0.70.tar.gz

WARNING: LICENSE is not a known parameter.
Checking if your kit is complete...
Looks good
'LICENSE' is not a known MakeMaker parameter name.
Writing Makefile for Test::Simple
cp lib/Test/Builder/Tester/Color.pm blib/lib/Test/Builder/Tester/Color.pm
cp lib/Test/Builder.pm blib/lib/Test/Builder.pm
cp lib/Test/Simple.pm blib/lib/Test/Simple.pm
cp lib/Test/More.pm blib/lib/Test/More.pm
cp lib/Test/Builder/Module.pm blib/lib/Test/Builder/Module.pm
cp lib/Test/Builder/Tester.pm blib/lib/Test/Builder/Tester.pm
cp lib/Test/Tutorial.pod blib/lib/Test/Tutorial.pod
Manifying blib/man3/Test::Builder::Tester::Color.3pm
Manifying blib/man3/Test::Simple.3pm
Manifying blib/man3/Test::Builder.3pm
Manifying blib/man3/Test::More.3pm
Manifying blib/man3/Test::Builder::Tester.3pm
Manifying blib/man3/Test::Builder::Module.3pm
Manifying blib/man3/Test::Tutorial.3pm
  MSCHWERN/Test-Simple-0.70.tar.gz
  /usr/bin/make PREFIX=~/perlmodules PREFIX=~/perlmodules -- OK
Running make test
PERL_DL_NONLAZY=1 /usr/bin/perl5.8.8 "-MExtUtils::Command::MM" "-e" "test_harness(0, 'blib/lib', 'blib/arch')" t/*.t
t/00signature.............WARNING: This key is not certified with a trusted signature!
Primary key fingerprint: 3669 19C5 3228 1283 6390  4112 58CA 2196 10F5 4327
t/00signature.............ok
t/00test_harness_check....ok
t/bad_plan................ok
t/bail_out................ok
t/buffer..................ok
t/Builder.................ok
t/carp....................ok
t/circular_data...........ok
t/create..................ok
t/curr_test...............ok
t/details.................ok
t/diag....................ok
t/eq_set..................ok
t/exit....................ok
t/extra...................ok
t/extra_one...............ok
t/fail-like...............ok
t/fail-more...............ok
t/fail....................ok
t/fail_one................ok
t/filehandles.............ok
t/fork....................ok
t/harness_active..........ok
t/has_plan................ok
t/has_plan2...............ok
t/import..................ok
t/is_deeply_fail..........ok
t/is_fh...................ok
t/maybe_regex.............ok
t/missing.................ok
t/More....................ok
t/no_diag.................ok
t/no_ending...............ok
t/no_header...............ok
t/no_plan.................ok
t/ok_obj..................ok
t/output..................ok
t/overload................ok
t/overload_threads........ok
        1/5 skipped: various reasons
t/plan....................ok
t/plan_bad................ok
t/plan_is_noplan..........ok
t/plan_no_plan............ok
        1/6 skipped: various reasons
t/plan_shouldnt_import....ok
t/plan_skip_all...........skipped
        all skipped: Just testing plan & skip_all
t/pod-coverage............skipped
        all skipped: Test::Pod::Coverage 1.08 required for testing POD coverage
t/pod.....................ok
t/require_ok..............ok
t/reset...................ok
t/simple..................ok
t/skip....................ok
        8/17 skipped: various reasons
t/skipall.................ok
t/sort_bug................skipped
        all skipped: no working threads
t/tbt_01basic.............ok
t/tbt_02fhrestore.........ok
t/tbt_03die...............ok
t/tbt_04line_num..........ok
t/tbt_05faildiag..........ok
t/tbt_06errormess.........ok
t/tbt_07args..............ok
t/thread_taint............ok
t/threads.................skipped
        all skipped: no working threads
t/todo....................ok
t/undef...................ok
t/use_ok..................ok
t/useing..................ok
All tests successful, 4 tests and 10 subtests skipped.
Files=66, Tests=491,  9 wallclock secs ( 3.45 cusr +  0.70 csys =  4.15 CPU)
  MSCHWERN/Test-Simple-0.70.tar.gz
  /usr/bin/make test -- OK
Running make install
Writing /usr/lib/perl5/5.8.8/i686-linux/auto/Test/Simple/.packlist
Appending installation info to /usr/lib/perl5/5.8.8/i686-linux/perllocal.pod
  MSCHWERN/Test-Simple-0.70.tar.gz
  /usr/bin/make install  -- OK
Data::Dumper is up to date (2.121_08).
Digest::SHA is up to date (5.44).
File::HomeDir is up to date (0.64).
Running install for module 'Compress::Zlib'
Running make for P/PM/PMQS/Compress-Zlib-2.004.tar.gz
Fetching with LWP:
  ftp://cpan.uchicago.edu/pub/CPAN/authors/id/P/PM/PMQS/Compress-Zlib-2.004.tar.gz
Fetching with LWP:
  ftp://cpan.uchicago.edu/pub/CPAN/authors/id/P/PM/PMQS/CHECKSUMS
Checksum for /root/.cpan/sources/authors/id/P/PM/PMQS/Compress-Zlib-2.004.tar.gz ok
Compress-Zlib-2.004/
Compress-Zlib-2.004/examples/
Compress-Zlib-2.004/examples/gzgrep
Compress-Zlib-2.004/examples/filtdef
Compress-Zlib-2.004/examples/gzcat
Compress-Zlib-2.004/examples/gzstream
Compress-Zlib-2.004/examples/filtinf
Compress-Zlib-2.004/t/
Compress-Zlib-2.004/t/000prereq.t
Compress-Zlib-2.004/t/03zlib-v1.t
Compress-Zlib-2.004/t/Test/
Compress-Zlib-2.004/t/Test/More.pm
Compress-Zlib-2.004/t/Test/Simple.pm
Compress-Zlib-2.004/t/Test/Builder.pm
Compress-Zlib-2.004/t/06gzsetp.t
Compress-Zlib-2.004/t/08encoding.t
Compress-Zlib-2.004/t/99pod.t
Compress-Zlib-2.004/t/01version.t
Compress-Zlib-2.004/t/14gzopen.t
Compress-Zlib-2.004/t/compress/
Compress-Zlib-2.004/t/compress/CompTestUtils.pm
Compress-Zlib-2.004/t/05examples.t
Compress-Zlib-2.004/lib/
Compress-Zlib-2.004/lib/Compress/
Compress-Zlib-2.004/lib/Compress/Zlib.pm
Compress-Zlib-2.004/Changes
Compress-Zlib-2.004/MANIFEST
Compress-Zlib-2.004/private/
Compress-Zlib-2.004/private/MakeUtil.pm
Compress-Zlib-2.004/META.yml
Compress-Zlib-2.004/pod/
Compress-Zlib-2.004/pod/FAQ.pod
Compress-Zlib-2.004/README
Compress-Zlib-2.004/Makefile.PL

  CPAN.pm: Going to build P/PM/PMQS/Compress-Zlib-2.004.tar.gz

Up/Downgrade not needed.
Checking if your kit is complete...
Looks good
Warning: prerequisite Compress::Raw::Zlib 2.004 not found. We have 2.001.
Warning: prerequisite IO::Compress::Base 2.004 not found. We have 2.001.
Warning: prerequisite IO::Compress::Base::Common 2.004 not found. We have 2.001.
Warning: prerequisite IO::Compress::Gzip 2.004 not found. We have 2.001.
Warning: prerequisite IO::Compress::Gzip::Constants 2.004 not found. We have 2.001.
Warning: prerequisite IO::Uncompress::Base 2.004 not found. We have 2.001.
Warning: prerequisite IO::Uncompress::Gunzip 2.004 not found. We have 2.001.
Writing Makefile for Compress::Zlib
---- Unsatisfied dependencies detected during ----
----      PMQS/Compress-Zlib-2.004.tar.gz     ----
    IO::Compress::Gzip::Constants [requires]
    IO::Uncompress::Base [requires]
    IO::Compress::Base [requires]
    IO::Uncompress::Gunzip [requires]
    IO::Compress::Gzip [requires]
    Compress::Raw::Zlib [requires]
    IO::Compress::Base::Common [requires]
Shall I follow them and prepend them to the queue
of modules we are processing right now? [yes]
Running make test
  Delayed until after prerequisites
Running make install
  Delayed until after prerequisites
Archive::Tar is up to date (1.30).
Running install for module 'Archive::Zip'
Running make for A/AD/ADAMK/Archive-Zip-1.18.tar.gz
Fetching with LWP:
  ftp://cpan.uchicago.edu/pub/CPAN/authors/id/A/AD/ADAMK/Archive-Zip-1.18.tar.gz
Fetching with LWP:
  ftp://cpan.uchicago.edu/pub/CPAN/authors/id/A/AD/ADAMK/CHECKSUMS
Checksum for /root/.cpan/sources/authors/id/A/AD/ADAMK/Archive-Zip-1.18.tar.gz ok
Archive-Zip-1.18/
Archive-Zip-1.18/t/
Archive-Zip-1.18/t/04_readmember.t
Archive-Zip-1.18/t/03_ex.t
Archive-Zip-1.18/t/badjpeg/
Archive-Zip-1.18/t/badjpeg/expected.jpg
Archive-Zip-1.18/t/badjpeg/source.zip
Archive-Zip-1.18/t/05_tree.t
Archive-Zip-1.18/t/01_compile.t
Archive-Zip-1.18/t/99_author.t
Archive-Zip-1.18/t/02_main.t
Archive-Zip-1.18/t/06_update.t
Archive-Zip-1.18/t/common.pl
Archive-Zip-1.18/lib/
Archive-Zip-1.18/lib/Archive/
Archive-Zip-1.18/lib/Archive/Zip/
Archive-Zip-1.18/lib/Archive/Zip/FileMember.pm
Archive-Zip-1.18/lib/Archive/Zip/StringMember.pm
Archive-Zip-1.18/lib/Archive/Zip/Member.pm
Archive-Zip-1.18/lib/Archive/Zip/Archive.pm
Archive-Zip-1.18/lib/Archive/Zip/ZipFileMember.pm
Archive-Zip-1.18/lib/Archive/Zip/BufferedFileHandle.pm
Archive-Zip-1.18/lib/Archive/Zip/NewFileMember.pm
Archive-Zip-1.18/lib/Archive/Zip/DirectoryMember.pm
Archive-Zip-1.18/lib/Archive/Zip/MockFileHandle.pm
Archive-Zip-1.18/lib/Archive/Zip/MemberRead.pm
Archive-Zip-1.18/lib/Archive/Zip/Tree.pm
Archive-Zip-1.18/lib/Archive/Zip/FAQ.pod
Archive-Zip-1.18/lib/Archive/Zip.pm
Archive-Zip-1.18/Changes
Archive-Zip-1.18/examples/
Archive-Zip-1.18/examples/mfh.pl
Archive-Zip-1.18/examples/updateZip.pl
Archive-Zip-1.18/examples/unzipAll.pl
Archive-Zip-1.18/examples/extract.pl
Archive-Zip-1.18/examples/readScalar.pl
Archive-Zip-1.18/examples/copy.pl
Archive-Zip-1.18/examples/zip.pl
Archive-Zip-1.18/examples/zipGrep.pl
Archive-Zip-1.18/examples/calcSizes.pl
Archive-Zip-1.18/examples/ziprecent.pl
Archive-Zip-1.18/examples/zipcheck.pl
Archive-Zip-1.18/examples/updateTree.pl
Archive-Zip-1.18/examples/writeScalar.pl
Archive-Zip-1.18/examples/selfex.pl
Archive-Zip-1.18/examples/zipinfo.pl
Archive-Zip-1.18/examples/ziptest.pl
Archive-Zip-1.18/examples/mailZip.pl
Archive-Zip-1.18/examples/writeScalar2.pl
Archive-Zip-1.18/docs/
Archive-Zip-1.18/docs/Archive-Zip.pdf
Archive-Zip-1.18/docs/appnote.iz
Archive-Zip-1.18/docs/Appnote.txt
Archive-Zip-1.18/docs/ideas.txt
Archive-Zip-1.18/MANIFEST
Archive-Zip-1.18/bin/
Archive-Zip-1.18/bin/crc32
Archive-Zip-1.18/INSTALL
Archive-Zip-1.18/README
Archive-Zip-1.18/Makefile.PL
Archive-Zip-1.18/LICENSE
Archive-Zip-1.18/META.yml

  CPAN.pm: Going to build A/AD/ADAMK/Archive-Zip-1.18.tar.gz

Checking if your kit is complete...
Looks good
Warning: prerequisite Compress::Zlib 1.14 not found.
Writing Makefile for Archive::Zip
cp lib/Archive/Zip/FileMember.pm blib/lib/Archive/Zip/FileMember.pm
cp lib/Archive/Zip/MockFileHandle.pm blib/lib/Archive/Zip/MockFileHandle.pm
cp lib/Archive/Zip/MemberRead.pm blib/lib/Archive/Zip/MemberRead.pm
cp lib/Archive/Zip/BufferedFileHandle.pm blib/lib/Archive/Zip/BufferedFileHandle.pm
cp lib/Archive/Zip/StringMember.pm blib/lib/Archive/Zip/StringMember.pm
cp lib/Archive/Zip/Tree.pm blib/lib/Archive/Zip/Tree.pm
cp lib/Archive/Zip/FAQ.pod blib/lib/Archive/Zip/FAQ.pod
cp lib/Archive/Zip/Member.pm blib/lib/Archive/Zip/Member.pm
cp lib/Archive/Zip/Archive.pm blib/lib/Archive/Zip/Archive.pm
cp lib/Archive/Zip.pm blib/lib/Archive/Zip.pm
cp lib/Archive/Zip/NewFileMember.pm blib/lib/Archive/Zip/NewFileMember.pm
cp lib/Archive/Zip/ZipFileMember.pm blib/lib/Archive/Zip/ZipFileMember.pm
cp lib/Archive/Zip/DirectoryMember.pm blib/lib/Archive/Zip/DirectoryMember.pm
cp bin/crc32 blib/script/crc32
/usr/bin/perl5.8.8 "-MExtUtils::MY" -e "MY->fixin(shift)" blib/script/crc32
Manifying blib/man3/Archive::Zip::Tree.3pm
Manifying blib/man3/Archive::Zip::FAQ.3pm
Manifying blib/man3/Archive::Zip.3pm
Manifying blib/man3/Archive::Zip::MemberRead.3pm
  ADAMK/Archive-Zip-1.18.tar.gz
  /usr/bin/make PREFIX=~/perlmodules PREFIX=~/perlmodules -- OK
Running make test
PERL_DL_NONLAZY=1 /usr/bin/perl5.8.8 "-MExtUtils::Command::MM" "-e" "test_harness(0, 'blib/lib', 'blib/arch')" t/*.t
t/01_compile.......Use of uninitialized value in concatenation (.) or string at /usr/lib/perl5/5.8.8/i686-linux/Scalar/Util.pm line 30.

#   Failed test 'use Archive::Zip;'
#   at t/01_compile.t line 5.
#     Tried to use 'Archive::Zip'.
#     Error:   is only avaliable with the XS version at /usr/lib/perl5/vendor_perl/5.8.8/Compress/Zlib.pm line 9
# BEGIN failed--compilation aborted at t/01_compile.t line 5.
# Compilation failed in require at /root/.cpan/build/Archive-Zip-1.18-Quwhnt/blib/lib/Archive/Zip.pm line 24.
# BEGIN failed--compilation aborted at /root/.cpan/build/Archive-Zip-1.18-Quwhnt/blib/lib/Archive/Zip.pm line 24.
# Compilation failed in require at (eval 3) line 2.
# BEGIN failed--compilation aborted at (eval 3) line 2.
"ERROR_CODES" is not defined in %Archive::Zip::EXPORT_TAGS at /root/.cpan/build/Archive-Zip-1.18-Quwhnt/blib/lib/Archive/Zip/MemberRead.pm line 39
"CONSTANTS" is not defined in %Archive::Zip::EXPORT_TAGS at /root/.cpan/build/Archive-Zip-1.18-Quwhnt/blib/lib/Archive/Zip/MemberRead.pm line 39

#   Failed test 'use Archive::Zip::MemberRead;'
#   at t/01_compile.t line 6.
#     Tried to use 'Archive::Zip::MemberRead'.
#     Error:  Can't continue after import errors at /root/.cpan/build/Archive-Zip-1.18-Quwhnt/blib/lib/Archive/Zip/MemberRead.pm line 39
# BEGIN failed--compilation aborted at t/01_compile.t line 6.
# Compilation failed in require at (eval 12) line 2.
# BEGIN failed--compilation aborted at (eval 12) line 2.
# Looks like you failed 2 tests of 2.
t/01_compile.......dubious
        Test returned status 2 (wstat 512, 0x200)
DIED. FAILED tests 1-2
        Failed 2/2 tests, 0.00% okay
t/02_main..........Use of uninitialized value in concatenation (.) or string at /usr/lib/perl5/5.8.8/i686-linux/Scalar/Util.pm line 30.
 is only avaliable with the XS version at /usr/lib/perl5/vendor_perl/5.8.8/Compress/Zlib.pm line 9
BEGIN failed--compilation aborted at /usr/lib/perl5/vendor_perl/5.8.8/Compress/Zlib.pm line 9.
Compilation failed in require at /root/.cpan/build/Archive-Zip-1.18-Quwhnt/blib/lib/Archive/Zip.pm line 24.
BEGIN failed--compilation aborted at /root/.cpan/build/Archive-Zip-1.18-Quwhnt/blib/lib/Archive/Zip.pm line 24.
Compilation failed in require at t/02_main.t line 6.
BEGIN failed--compilation aborted at t/02_main.t line 6.
t/02_main..........dubious
        Test returned status 255 (wstat 65280, 0xff00)
t/03_ex............Use of uninitialized value in concatenation (.) or string at /usr/lib/perl5/5.8.8/i686-linux/Scalar/Util.pm line 30.
 is only avaliable with the XS version at /usr/lib/perl5/vendor_perl/5.8.8/Compress/Zlib.pm line 9
BEGIN failed--compilation aborted at /usr/lib/perl5/vendor_perl/5.8.8/Compress/Zlib.pm line 9.
Compilation failed in require at /root/.cpan/build/Archive-Zip-1.18-Quwhnt/blib/lib/Archive/Zip.pm line 24.
BEGIN failed--compilation aborted at /root/.cpan/build/Archive-Zip-1.18-Quwhnt/blib/lib/Archive/Zip.pm line 24.
Compilation failed in require at t/03_ex.t line 4.
BEGIN failed--compilation aborted at t/03_ex.t line 4.
t/03_ex............dubious
        Test returned status 255 (wstat 65280, 0xff00)
t/04_readmember....Use of uninitialized value in concatenation (.) or string at /usr/lib/perl5/5.8.8/i686-linux/Scalar/Util.pm line 30.
 is only avaliable with the XS version at /usr/lib/perl5/vendor_perl/5.8.8/Compress/Zlib.pm line 9
BEGIN failed--compilation aborted at /usr/lib/perl5/vendor_perl/5.8.8/Compress/Zlib.pm line 9.
Compilation failed in require at /root/.cpan/build/Archive-Zip-1.18-Quwhnt/blib/lib/Archive/Zip.pm line 24.
BEGIN failed--compilation aborted at /root/.cpan/build/Archive-Zip-1.18-Quwhnt/blib/lib/Archive/Zip.pm line 24.
Compilation failed in require at t/04_readmember.t line 4.
BEGIN failed--compilation aborted at t/04_readmember.t line 4.
t/04_readmember....dubious
        Test returned status 255 (wstat 65280, 0xff00)
t/05_tree..........Use of uninitialized value in concatenation (.) or string at /usr/lib/perl5/5.8.8/i686-linux/Scalar/Util.pm line 30.
 is only avaliable with the XS version at /usr/lib/perl5/vendor_perl/5.8.8/Compress/Zlib.pm line 9
BEGIN failed--compilation aborted at /usr/lib/perl5/vendor_perl/5.8.8/Compress/Zlib.pm line 9.
Compilation failed in require at /root/.cpan/build/Archive-Zip-1.18-Quwhnt/blib/lib/Archive/Zip.pm line 24.
BEGIN failed--compilation aborted at /root/.cpan/build/Archive-Zip-1.18-Quwhnt/blib/lib/Archive/Zip.pm line 24.
Compilation failed in require at t/05_tree.t line 4.
BEGIN failed--compilation aborted at t/05_tree.t line 4.
t/05_tree..........dubious
        Test returned status 255 (wstat 65280, 0xff00)
t/06_update........Use of uninitialized value in concatenation (.) or string at /usr/lib/perl5/5.8.8/i686-linux/Scalar/Util.pm line 30.
 is only avaliable with the XS version at /usr/lib/perl5/vendor_perl/5.8.8/Compress/Zlib.pm line 9
BEGIN failed--compilation aborted at /usr/lib/perl5/vendor_perl/5.8.8/Compress/Zlib.pm line 9.
Compilation failed in require at /root/.cpan/build/Archive-Zip-1.18-Quwhnt/blib/lib/Archive/Zip.pm line 24.
BEGIN failed--compilation aborted at /root/.cpan/build/Archive-Zip-1.18-Quwhnt/blib/lib/Archive/Zip.pm line 24.
Compilation failed in require at t/06_update.t line 9.
BEGIN failed--compilation aborted at t/06_update.t line 9.
t/06_update........dubious
        Test returned status 255 (wstat 65280, 0xff00)
t/99_author........skipped
        all skipped: Author tests not required for installation
Failed Test       Stat Wstat Total Fail  List of Failed
-------------------------------------------------------------------------------
t/01_compile.t       2   512     2    2  1-2
t/02_main.t        255 65280    ??   ??  ??
t/03_ex.t          255 65280    ??   ??  ??
t/04_readmember.t  255 65280    ??   ??  ??
t/05_tree.t        255 65280    ??   ??  ??
t/06_update.t      255 65280    ??   ??  ??
1 test skipped.
Failed 6/7 test scripts. 2/2 subtests failed.
Files=7, Tests=2,  1 wallclock secs ( 0.36 cusr +  0.07 csys =  0.43 CPU)
Failed 6/7 test programs. 2/2 subtests failed.
make: *** [test_dynamic] Error 255
  ADAMK/Archive-Zip-1.18.tar.gz
  /usr/bin/make test -- NOT OK
Running make install
  make test had returned bad status, won't install without force
Net::Cmd is up to date (2.27).
Net::FTP is up to date (2.77).
Term::ReadKey is up to date (2.30).
Term::ReadLine::Perl is up to date (1.0302).
YAML is up to date (0.62).
Text::Glob is up to date (0.07).
CPAN is up to date (1.90).
File::Which is up to date (0.05).
Running install for module 'IO::Compress::Gzip::Constants'
Running make for P/PM/PMQS/IO-Compress-Zlib-2.004.tar.gz
Fetching with LWP:
  ftp://cpan.uchicago.edu/pub/CPAN/authors/id/P/PM/PMQS/IO-Compress-Zlib-2.004.tar.gz
Checksum for /root/.cpan/sources/authors/id/P/PM/PMQS/IO-Compress-Zlib-2.004.tar.gz ok
IO-Compress-Zlib-2.004/
IO-Compress-Zlib-2.004/t/
IO-Compress-Zlib-2.004/t/101truncate-gzip.t
IO-Compress-Zlib-2.004/t/004gziphdr.t
IO-Compress-Zlib-2.004/t/000prereq.t
IO-Compress-Zlib-2.004/t/002any-rawdeflate.t
IO-Compress-Zlib-2.004/t/109merge-gzip.t
IO-Compress-Zlib-2.004/t/109merge-deflate.t
IO-Compress-Zlib-2.004/t/001zlib-generic-deflate.t
IO-Compress-Zlib-2.004/t/108anyunc-transparent.t
IO-Compress-Zlib-2.004/t/103newtied-rawdeflate.t
IO-Compress-Zlib-2.004/t/102tied-deflate.t
IO-Compress-Zlib-2.004/t/107multi-gzip.t
IO-Compress-Zlib-2.004/t/Test/
IO-Compress-Zlib-2.004/t/Test/Builder.pm
IO-Compress-Zlib-2.004/t/Test/More.pm
IO-Compress-Zlib-2.004/t/Test/Simple.pm
IO-Compress-Zlib-2.004/t/compress/
IO-Compress-Zlib-2.004/t/compress/destroy.pl
IO-Compress-Zlib-2.004/t/compress/CompTestUtils.pm
IO-Compress-Zlib-2.004/t/compress/newtied.pl
IO-Compress-Zlib-2.004/t/compress/merge.pl
IO-Compress-Zlib-2.004/t/compress/anyunc.pl
IO-Compress-Zlib-2.004/t/compress/truncate.pl
IO-Compress-Zlib-2.004/t/compress/any.pl
IO-Compress-Zlib-2.004/t/compress/generic.pl
IO-Compress-Zlib-2.004/t/compress/zlib-generic.pl
IO-Compress-Zlib-2.004/t/compress/oneshot.pl
IO-Compress-Zlib-2.004/t/compress/prime.pl
IO-Compress-Zlib-2.004/t/compress/tied.pl
IO-Compress-Zlib-2.004/t/compress/multi.pl
IO-Compress-Zlib-2.004/t/102tied-rawdeflate.t
IO-Compress-Zlib-2.004/t/001zlib-generic-rawdeflate.t
IO-Compress-Zlib-2.004/t/105oneshot-deflate.t
IO-Compress-Zlib-2.004/t/102tied-gzip.t
IO-Compress-Zlib-2.004/t/999pod.t
IO-Compress-Zlib-2.004/t/108anyunc-deflate.t
IO-Compress-Zlib-2.004/t/104destroy-gzip.t
IO-Compress-Zlib-2.004/t/106prime-zip.t
IO-Compress-Zlib-2.004/t/101truncate-zip.t
IO-Compress-Zlib-2.004/t/105oneshot-gzip.t
IO-Compress-Zlib-2.004/t/108anyunc-zip.t
IO-Compress-Zlib-2.004/t/106prime-rawdeflate.t
IO-Compress-Zlib-2.004/t/105oneshot-zip-only.t
IO-Compress-Zlib-2.004/t/105oneshot-rawdeflate.t
IO-Compress-Zlib-2.004/t/100generic-rawdeflate.t
IO-Compress-Zlib-2.004/t/100generic-gzip.t
IO-Compress-Zlib-2.004/t/002any-deflate.t
IO-Compress-Zlib-2.004/t/107multi-deflate.t
IO-Compress-Zlib-2.004/t/001zlib-generic-gzip.t
IO-Compress-Zlib-2.004/t/105oneshot-zip.t
IO-Compress-Zlib-2.004/t/101truncate-rawdeflate.t
IO-Compress-Zlib-2.004/t/100generic-zip.t
IO-Compress-Zlib-2.004/t/103newtied-deflate.t
IO-Compress-Zlib-2.004/t/001zlib-generic-zip.t
IO-Compress-Zlib-2.004/t/105oneshot-gzip-only.t
IO-Compress-Zlib-2.004/t/002any-gzip.t
IO-Compress-Zlib-2.004/t/100generic-deflate.t
IO-Compress-Zlib-2.004/t/101truncate-deflate.t
IO-Compress-Zlib-2.004/t/102tied-zip.t
IO-Compress-Zlib-2.004/t/109merge-zip.t
IO-Compress-Zlib-2.004/t/005defhdr.t
IO-Compress-Zlib-2.004/t/103newtied-zip.t
IO-Compress-Zlib-2.004/t/050interop-gzip.t
IO-Compress-Zlib-2.004/t/104destroy-rawdeflate.t
IO-Compress-Zlib-2.004/t/104destroy-zip.t
IO-Compress-Zlib-2.004/t/108anyunc-rawdeflate.t
IO-Compress-Zlib-2.004/t/020isize.t
IO-Compress-Zlib-2.004/t/109merge-rawdeflate.t
IO-Compress-Zlib-2.004/t/002any-zip.t
IO-Compress-Zlib-2.004/t/108anyunc-gzip.t
IO-Compress-Zlib-2.004/t/104destroy-deflate.t
IO-Compress-Zlib-2.004/t/107multi-zip.t
IO-Compress-Zlib-2.004/t/106prime-gzip.t
IO-Compress-Zlib-2.004/t/107multi-rawdeflate.t
IO-Compress-Zlib-2.004/t/002any-transparent.t
IO-Compress-Zlib-2.004/t/010examples.t
IO-Compress-Zlib-2.004/t/103newtied-gzip.t
IO-Compress-Zlib-2.004/t/106prime-deflate.t
IO-Compress-Zlib-2.004/t/105oneshot-zip-bzip2-only.t
IO-Compress-Zlib-2.004/examples/
IO-Compress-Zlib-2.004/examples/gzgrep
IO-Compress-Zlib-2.004/examples/anycat
IO-Compress-Zlib-2.004/examples/gzappend
IO-Compress-Zlib-2.004/examples/gzstream
IO-Compress-Zlib-2.004/examples/gzcat
IO-Compress-Zlib-2.004/Changes
IO-Compress-Zlib-2.004/lib/
IO-Compress-Zlib-2.004/lib/IO/
IO-Compress-Zlib-2.004/lib/IO/Compress/
IO-Compress-Zlib-2.004/lib/IO/Compress/Adapter/
IO-Compress-Zlib-2.004/lib/IO/Compress/Adapter/Deflate.pm
IO-Compress-Zlib-2.004/lib/IO/Compress/Adapter/Identity.pm
IO-Compress-Zlib-2.004/lib/IO/Compress/Deflate.pm
IO-Compress-Zlib-2.004/lib/IO/Compress/Zip.pm
IO-Compress-Zlib-2.004/lib/IO/Compress/Gzip/
IO-Compress-Zlib-2.004/lib/IO/Compress/Gzip/Constants.pm
IO-Compress-Zlib-2.004/lib/IO/Compress/Zlib/
IO-Compress-Zlib-2.004/lib/IO/Compress/Zlib/Extra.pm
IO-Compress-Zlib-2.004/lib/IO/Compress/Zlib/Constants.pm
IO-Compress-Zlib-2.004/lib/IO/Compress/Zip/
IO-Compress-Zlib-2.004/lib/IO/Compress/Zip/Constants.pm
IO-Compress-Zlib-2.004/lib/IO/Compress/RawDeflate.pm
IO-Compress-Zlib-2.004/lib/IO/Compress/Gzip.pm
IO-Compress-Zlib-2.004/lib/IO/Uncompress/
IO-Compress-Zlib-2.004/lib/IO/Uncompress/Inflate.pm
IO-Compress-Zlib-2.004/lib/IO/Uncompress/Unzip.pm
IO-Compress-Zlib-2.004/lib/IO/Uncompress/AnyInflate.pm
IO-Compress-Zlib-2.004/lib/IO/Uncompress/RawInflate.pm
IO-Compress-Zlib-2.004/lib/IO/Uncompress/Adapter/
IO-Compress-Zlib-2.004/lib/IO/Uncompress/Adapter/Identity.pm
IO-Compress-Zlib-2.004/lib/IO/Uncompress/Adapter/Inflate.pm
IO-Compress-Zlib-2.004/lib/IO/Uncompress/Gunzip.pm
IO-Compress-Zlib-2.004/MANIFEST
IO-Compress-Zlib-2.004/pod/
IO-Compress-Zlib-2.004/pod/FAQ.pod
IO-Compress-Zlib-2.004/README
IO-Compress-Zlib-2.004/private/
IO-Compress-Zlib-2.004/private/MakeUtil.pm
IO-Compress-Zlib-2.004/Makefile.PL
IO-Compress-Zlib-2.004/META.yml

  CPAN.pm: Going to build P/PM/PMQS/IO-Compress-Zlib-2.004.tar.gz

Up/Downgrade not needed.
Checking if your kit is complete...
Looks good
Warning: prerequisite Compress::Raw::Zlib 2.004 not found. We have 2.001.
Warning: prerequisite IO::Compress::Base 2.004 not found. We have 2.001.
Warning: prerequisite IO::Uncompress::Base 2.004 not found. We have 2.001.
Writing Makefile for IO::Compress::Zlib
---- Unsatisfied dependencies detected during ----
----    PMQS/IO-Compress-Zlib-2.004.tar.gz    ----
    IO::Uncompress::Base [requires]
    IO::Compress::Base [requires]
    Compress::Raw::Zlib [requires]
Shall I follow them and prepend them to the queue
of modules we are processing right now? [yes]
Running make test
  Delayed until after prerequisites
Running make install
  Delayed until after prerequisites
Running install for module 'IO::Uncompress::Base'
Running make for P/PM/PMQS/IO-Compress-Base-2.004.tar.gz
Fetching with LWP:
  ftp://cpan.uchicago.edu/pub/CPAN/authors/id/P/PM/PMQS/IO-Compress-Base-2.004.tar.gz
Checksum for /root/.cpan/sources/authors/id/P/PM/PMQS/IO-Compress-Base-2.004.tar.gz ok
IO-Compress-Base-2.004/
IO-Compress-Base-2.004/t/
IO-Compress-Base-2.004/t/compress/
IO-Compress-Base-2.004/t/compress/generic.pl
IO-Compress-Base-2.004/t/compress/zlib-generic.pl
IO-Compress-Base-2.004/t/compress/merge.pl
IO-Compress-Base-2.004/t/compress/oneshot.pl
IO-Compress-Base-2.004/t/compress/anyunc.pl
IO-Compress-Base-2.004/t/compress/newtied.pl
IO-Compress-Base-2.004/t/compress/prime.pl
IO-Compress-Base-2.004/t/compress/tied.pl
IO-Compress-Base-2.004/t/compress/truncate.pl
IO-Compress-Base-2.004/t/compress/multi.pl
IO-Compress-Base-2.004/t/compress/destroy.pl
IO-Compress-Base-2.004/t/compress/CompTestUtils.pm
IO-Compress-Base-2.004/t/compress/any.pl
IO-Compress-Base-2.004/t/000prereq.t
IO-Compress-Base-2.004/t/Test/
IO-Compress-Base-2.004/t/Test/More.pm
IO-Compress-Base-2.004/t/Test/Simple.pm
IO-Compress-Base-2.004/t/Test/Builder.pm
IO-Compress-Base-2.004/t/01misc.t
IO-Compress-Base-2.004/t/99pod.t
IO-Compress-Base-2.004/t/globmapper.t
IO-Compress-Base-2.004/Changes
IO-Compress-Base-2.004/lib/
IO-Compress-Base-2.004/lib/IO/
IO-Compress-Base-2.004/lib/IO/Uncompress/
IO-Compress-Base-2.004/lib/IO/Uncompress/Base.pm
IO-Compress-Base-2.004/lib/IO/Uncompress/AnyUncompress.pm
IO-Compress-Base-2.004/lib/IO/Compress/
IO-Compress-Base-2.004/lib/IO/Compress/Base.pm
IO-Compress-Base-2.004/lib/IO/Compress/Base/
IO-Compress-Base-2.004/lib/IO/Compress/Base/Common.pm
IO-Compress-Base-2.004/lib/File/
IO-Compress-Base-2.004/lib/File/GlobMapper.pm
IO-Compress-Base-2.004/private/
IO-Compress-Base-2.004/private/MakeUtil.pm
IO-Compress-Base-2.004/MANIFEST
IO-Compress-Base-2.004/META.yml
IO-Compress-Base-2.004/pod/
IO-Compress-Base-2.004/pod/FAQ.pod
IO-Compress-Base-2.004/Makefile.PL
IO-Compress-Base-2.004/README

  CPAN.pm: Going to build P/PM/PMQS/IO-Compress-Base-2.004.tar.gz

Up/Downgrade not needed.
Checking if your kit is complete...
Looks good
Writing Makefile for IO::Compress::Base
cp lib/IO/Uncompress/Base.pm blib/lib/IO/Uncompress/Base.pm
cp lib/IO/Uncompress/AnyUncompress.pm blib/lib/IO/Uncompress/AnyUncompress.pm
cp lib/IO/Compress/Base.pm blib/lib/IO/Compress/Base.pm
cp lib/File/GlobMapper.pm blib/lib/File/GlobMapper.pm
cp lib/IO/Compress/Base/Common.pm blib/lib/IO/Compress/Base/Common.pm
Manifying blib/man3/IO::Uncompress::AnyUncompress.3pm
Manifying blib/man3/IO::Uncompress::Base.3pm
Manifying blib/man3/File::GlobMapper.3pm
Manifying blib/man3/IO::Compress::Base.3pm
  PMQS/IO-Compress-Base-2.004.tar.gz
  /usr/bin/make PREFIX=~/perlmodules PREFIX=~/perlmodules -- OK
Running make test
PERL_DL_NONLAZY=1 /usr/bin/perl5.8.8 "-MExtUtils::Command::MM" "-e" "test_harness(0, 'blib/lib', 'blib/arch')" t/*.t
t/000prereq.....ok
t/01misc........Use of uninitialized value in concatenation (.) or string at /usr/lib/perl5/5.8.8/i686-linux/Scalar/Util.pm line 30.

#     Failed test (t/01misc.t at line 29)
# You don't have the XS version of Scalar::Util
t/01misc........NOK 3/78# Looks like you failed 1 test of 78.
t/01misc........dubious
        Test returned status 1 (wstat 256, 0x100)
DIED. FAILED test 3
        Failed 1/78 tests, 98.72% okay
t/99pod.........ok
t/globmapper....ok
Failed Test Stat Wstat Total Fail  List of Failed
-------------------------------------------------------------------------------
t/01misc.t     1   256    78    1  3
Failed 1/4 test scripts. 1/152 subtests failed.
Files=4, Tests=152,  1 wallclock secs ( 0.70 cusr +  0.07 csys =  0.77 CPU)
Failed 1/4 test programs. 1/152 subtests failed.
make: *** [test_dynamic] Error 255
  PMQS/IO-Compress-Base-2.004.tar.gz
  /usr/bin/make test -- NOT OK
Running make install
  make test had returned bad status, won't install without force
Running install for module 'IO::Compress::Base'
Running make install
  make test had returned bad status, won't install without force
Running install for module 'Compress::Raw::Zlib'
Running make for P/PM/PMQS/Compress-Raw-Zlib-2.004.tar.gz
Fetching with LWP:
  ftp://cpan.uchicago.edu/pub/CPAN/authors/id/P/PM/PMQS/Compress-Raw-Zlib-2.004.tar.gz
Checksum for /root/.cpan/sources/authors/id/P/PM/PMQS/Compress-Raw-Zlib-2.004.tar.gz ok
Compress-Raw-Zlib-2.004/
Compress-Raw-Zlib-2.004/zlib-src/
Compress-Raw-Zlib-2.004/zlib-src/compress.c
Compress-Raw-Zlib-2.004/zlib-src/inffixed.h
Compress-Raw-Zlib-2.004/zlib-src/zlib.h
Compress-Raw-Zlib-2.004/zlib-src/zutil.h
Compress-Raw-Zlib-2.004/zlib-src/inftrees.h
Compress-Raw-Zlib-2.004/zlib-src/zconf.h
Compress-Raw-Zlib-2.004/zlib-src/crc32.h
Compress-Raw-Zlib-2.004/zlib-src/uncompr.c
Compress-Raw-Zlib-2.004/zlib-src/zutil.c
Compress-Raw-Zlib-2.004/zlib-src/deflate.c
Compress-Raw-Zlib-2.004/zlib-src/inftrees.c
Compress-Raw-Zlib-2.004/zlib-src/crc32.c
Compress-Raw-Zlib-2.004/zlib-src/deflate.h
Compress-Raw-Zlib-2.004/zlib-src/inffast.h
Compress-Raw-Zlib-2.004/zlib-src/adler32.c
Compress-Raw-Zlib-2.004/zlib-src/trees.c
Compress-Raw-Zlib-2.004/zlib-src/infback.c
Compress-Raw-Zlib-2.004/zlib-src/trees.h
Compress-Raw-Zlib-2.004/zlib-src/inflate.h
Compress-Raw-Zlib-2.004/zlib-src/inffast.c
Compress-Raw-Zlib-2.004/zlib-src/inflate.c
Compress-Raw-Zlib-2.004/t/
Compress-Raw-Zlib-2.004/t/000prereq.t
Compress-Raw-Zlib-2.004/t/Test/
Compress-Raw-Zlib-2.004/t/Test/More.pm
Compress-Raw-Zlib-2.004/t/Test/Simple.pm
Compress-Raw-Zlib-2.004/t/Test/Builder.pm
Compress-Raw-Zlib-2.004/t/01version.t
Compress-Raw-Zlib-2.004/t/compress/
Compress-Raw-Zlib-2.004/t/compress/CompTestUtils.pm
Compress-Raw-Zlib-2.004/t/02zlib.t
Compress-Raw-Zlib-2.004/t/18lvalue.t
Compress-Raw-Zlib-2.004/t/07bufsize.t
Compress-Raw-Zlib-2.004/t/99pod.t
Compress-Raw-Zlib-2.004/Zlib.xs
Compress-Raw-Zlib-2.004/Changes
Compress-Raw-Zlib-2.004/MANIFEST
Compress-Raw-Zlib-2.004/typemap
Compress-Raw-Zlib-2.004/examples/
Compress-Raw-Zlib-2.004/examples/filtdef
Compress-Raw-Zlib-2.004/examples/filtinf
Compress-Raw-Zlib-2.004/META.yml
Compress-Raw-Zlib-2.004/fallback/
Compress-Raw-Zlib-2.004/fallback/constants.h
Compress-Raw-Zlib-2.004/fallback/constants.xs
Compress-Raw-Zlib-2.004/lib/
Compress-Raw-Zlib-2.004/lib/Compress/
Compress-Raw-Zlib-2.004/lib/Compress/Raw/
Compress-Raw-Zlib-2.004/lib/Compress/Raw/Zlib.pm
Compress-Raw-Zlib-2.004/private/
Compress-Raw-Zlib-2.004/private/MakeUtil.pm
Compress-Raw-Zlib-2.004/ppport.h
Compress-Raw-Zlib-2.004/config.in
Compress-Raw-Zlib-2.004/pod/
Compress-Raw-Zlib-2.004/pod/FAQ.pod
Compress-Raw-Zlib-2.004/Makefile.PL
Compress-Raw-Zlib-2.004/README

  CPAN.pm: Going to build P/PM/PMQS/Compress-Raw-Zlib-2.004.tar.gz

Parsing config.in...
Building Zlib enabled
Auto Detect Gzip OS Code..
Setting Gzip OS Code to 3 [Unix/Default]
Looks Good.
Up/Downgrade not needed.
Checking if your kit is complete...
Looks good
Writing Makefile for Compress::Raw::Zlib
cp lib/Compress/Raw/Zlib.pm blib/lib/Compress/Raw/Zlib.pm
AutoSplitting blib/lib/Compress/Raw/Zlib.pm (blib/lib/auto/Compress/Raw/Zlib)
/usr/bin/perl5.8.8 /usr/lib/perl5/5.8.8/ExtUtils/xsubpp  -typemap /usr/lib/perl5/5.8.8/ExtUtils/typemap -typemap typemap  Zlib.xs > Zlib.xsc && mv Zlib.xsc Zlib.c
i686-pc-linux-gnu-gcc -c  -I./zlib-src -fno-strict-aliasing -pipe -Wdeclaration-after-statement -D_LARGEFILE_SOURCE -D_FILE_OFFSET_BITS=64 -O2 -march=pentium4 -pipe -fomit-frame-pointer   -DVERSION=\"2.004\" -DXS_VERSION=\"2.004\" -fPIC "-I/usr/lib/perl5/5.8.8/i686-linux/CORE"  -DGZIP_OS_CODE=3 Zlib.c
i686-pc-linux-gnu-gcc -c  -I./zlib-src -fno-strict-aliasing -pipe -Wdeclaration-after-statement -D_LARGEFILE_SOURCE -D_FILE_OFFSET_BITS=64 -O2 -march=pentium4 -pipe -fomit-frame-pointer   -DVERSION=\"2.004\" -DXS_VERSION=\"2.004\" -fPIC "-I/usr/lib/perl5/5.8.8/i686-linux/CORE"  -DGZIP_OS_CODE=3 adler32.c
i686-pc-linux-gnu-gcc -c  -I./zlib-src -fno-strict-aliasing -pipe -Wdeclaration-after-statement -D_LARGEFILE_SOURCE -D_FILE_OFFSET_BITS=64 -O2 -march=pentium4 -pipe -fomit-frame-pointer   -DVERSION=\"2.004\" -DXS_VERSION=\"2.004\" -fPIC "-I/usr/lib/perl5/5.8.8/i686-linux/CORE"  -DGZIP_OS_CODE=3 crc32.c
i686-pc-linux-gnu-gcc -c  -I./zlib-src -fno-strict-aliasing -pipe -Wdeclaration-after-statement -D_LARGEFILE_SOURCE -D_FILE_OFFSET_BITS=64 -O2 -march=pentium4 -pipe -fomit-frame-pointer   -DVERSION=\"2.004\" -DXS_VERSION=\"2.004\" -fPIC "-I/usr/lib/perl5/5.8.8/i686-linux/CORE"  -DGZIP_OS_CODE=3 infback.c
i686-pc-linux-gnu-gcc -c  -I./zlib-src -fno-strict-aliasing -pipe -Wdeclaration-after-statement -D_LARGEFILE_SOURCE -D_FILE_OFFSET_BITS=64 -O2 -march=pentium4 -pipe -fomit-frame-pointer   -DVERSION=\"2.004\" -DXS_VERSION=\"2.004\" -fPIC "-I/usr/lib/perl5/5.8.8/i686-linux/CORE"  -DGZIP_OS_CODE=3 inflate.c
i686-pc-linux-gnu-gcc -c  -I./zlib-src -fno-strict-aliasing -pipe -Wdeclaration-after-statement -D_LARGEFILE_SOURCE -D_FILE_OFFSET_BITS=64 -O2 -march=pentium4 -pipe -fomit-frame-pointer   -DVERSION=\"2.004\" -DXS_VERSION=\"2.004\" -fPIC "-I/usr/lib/perl5/5.8.8/i686-linux/CORE"  -DGZIP_OS_CODE=3 uncompr.c
i686-pc-linux-gnu-gcc -c  -I./zlib-src -fno-strict-aliasing -pipe -Wdeclaration-after-statement -D_LARGEFILE_SOURCE -D_FILE_OFFSET_BITS=64 -O2 -march=pentium4 -pipe -fomit-frame-pointer   -DVERSION=\"2.004\" -DXS_VERSION=\"2.004\" -fPIC "-I/usr/lib/perl5/5.8.8/i686-linux/CORE"  -DGZIP_OS_CODE=3 compress.c
i686-pc-linux-gnu-gcc -c  -I./zlib-src -fno-strict-aliasing -pipe -Wdeclaration-after-statement -D_LARGEFILE_SOURCE -D_FILE_OFFSET_BITS=64 -O2 -march=pentium4 -pipe -fomit-frame-pointer   -DVERSION=\"2.004\" -DXS_VERSION=\"2.004\" -fPIC "-I/usr/lib/perl5/5.8.8/i686-linux/CORE"  -DGZIP_OS_CODE=3 deflate.c
i686-pc-linux-gnu-gcc -c  -I./zlib-src -fno-strict-aliasing -pipe -Wdeclaration-after-statement -D_LARGEFILE_SOURCE -D_FILE_OFFSET_BITS=64 -O2 -march=pentium4 -pipe -fomit-frame-pointer   -DVERSION=\"2.004\" -DXS_VERSION=\"2.004\" -fPIC "-I/usr/lib/perl5/5.8.8/i686-linux/CORE"  -DGZIP_OS_CODE=3 inffast.c
i686-pc-linux-gnu-gcc -c  -I./zlib-src -fno-strict-aliasing -pipe -Wdeclaration-after-statement -D_LARGEFILE_SOURCE -D_FILE_OFFSET_BITS=64 -O2 -march=pentium4 -pipe -fomit-frame-pointer   -DVERSION=\"2.004\" -DXS_VERSION=\"2.004\" -fPIC "-I/usr/lib/perl5/5.8.8/i686-linux/CORE"  -DGZIP_OS_CODE=3 inftrees.c
i686-pc-linux-gnu-gcc -c  -I./zlib-src -fno-strict-aliasing -pipe -Wdeclaration-after-statement -D_LARGEFILE_SOURCE -D_FILE_OFFSET_BITS=64 -O2 -march=pentium4 -pipe -fomit-frame-pointer   -DVERSION=\"2.004\" -DXS_VERSION=\"2.004\" -fPIC "-I/usr/lib/perl5/5.8.8/i686-linux/CORE"  -DGZIP_OS_CODE=3 trees.c
i686-pc-linux-gnu-gcc -c  -I./zlib-src -fno-strict-aliasing -pipe -Wdeclaration-after-statement -D_LARGEFILE_SOURCE -D_FILE_OFFSET_BITS=64 -O2 -march=pentium4 -pipe -fomit-frame-pointer   -DVERSION=\"2.004\" -DXS_VERSION=\"2.004\" -fPIC "-I/usr/lib/perl5/5.8.8/i686-linux/CORE"  -DGZIP_OS_CODE=3 zutil.c
Running Mkbootstrap for Compress::Raw::Zlib ()
chmod 644 Zlib.bs
rm -f blib/arch/auto/Compress/Raw/Zlib/Zlib.so
i686-pc-linux-gnu-gcc  -shared -L/usr/local/lib Zlib.o adler32.o crc32.o infback.o inflate.o uncompr.o compress.o deflate.o inffast.o inftrees.o trees.o zutil.o   -o blib/arch/auto/Compress/Raw/Zlib/Zlib.so     \
                \

chmod 755 blib/arch/auto/Compress/Raw/Zlib/Zlib.so
cp Zlib.bs blib/arch/auto/Compress/Raw/Zlib/Zlib.bs
chmod 644 blib/arch/auto/Compress/Raw/Zlib/Zlib.bs
Manifying blib/man3/Compress::Raw::Zlib.3pm
  PMQS/Compress-Raw-Zlib-2.004.tar.gz
  /usr/bin/make PREFIX=~/perlmodules PREFIX=~/perlmodules -- OK
Running make test
PERL_DL_NONLAZY=1 /usr/bin/perl5.8.8 "-MExtUtils::Command::MM" "-e" "test_harness(0, 'blib/lib', 'blib/arch')" t/*.t
t/000prereq....ok
t/01version....ok
t/02zlib.......ok
t/07bufsize....ok
t/18lvalue.....ok
t/99pod........ok
All tests successful.
Files=6, Tests=545, 13 wallclock secs ( 4.98 cusr +  0.17 csys =  5.15 CPU)
  PMQS/Compress-Raw-Zlib-2.004.tar.gz
  /usr/bin/make test -- OK
Running make install
Files found in blib/arch: installing files in blib/lib into architecture dependent library tree
Writing /usr/lib/perl5/site_perl/5.8.8/i686-linux/auto/Compress/Raw/Zlib/.packlist
Appending installation info to /usr/lib/perl5/5.8.8/i686-linux/perllocal.pod
  PMQS/Compress-Raw-Zlib-2.004.tar.gz
  /usr/bin/make install  -- OK
Running make for P/PM/PMQS/IO-Compress-Zlib-2.004.tar.gz
  Has already been unwrapped into directory /root/.cpan/build/IO-Compress-Zlib-2.004-1N88d1

  CPAN.pm: Going to build P/PM/PMQS/IO-Compress-Zlib-2.004.tar.gz

Warning: Prerequisite 'IO::Uncompress::Base => 2.004' for 'P/PM/PMQS/IO-Compress-Zlib-2.004.tar.gz' failed when processing 'P/PM/PMQS/IO-Compress-Base-2.004.tar.gz' with 'make_test => NO'. Continuing, but chances to succeed are limited.
Warning: Prerequisite 'IO::Compress::Base => 2.004' for 'P/PM/PMQS/IO-Compress-Zlib-2.004.tar.gz' failed when processing 'P/PM/PMQS/IO-Compress-Base-2.004.tar.gz' with 'make_test => NO'. Continuing, but chances to succeed are limited.
Warning: Prerequisite 'Compress::Raw::Zlib => 2.004' for 'P/PM/PMQS/IO-Compress-Zlib-2.004.tar.gz' already installed but installation looks suspicious. Skipping another installation attempt, to prevent looping endlessly.
cp lib/IO/Uncompress/RawInflate.pm blib/lib/IO/Uncompress/RawInflate.pm
cp lib/IO/Uncompress/Inflate.pm blib/lib/IO/Uncompress/Inflate.pm
cp lib/IO/Compress/Deflate.pm blib/lib/IO/Compress/Deflate.pm
cp lib/IO/Compress/Adapter/Deflate.pm blib/lib/IO/Compress/Adapter/Deflate.pm
cp lib/IO/Compress/Zip.pm blib/lib/IO/Compress/Zip.pm
cp lib/IO/Uncompress/Adapter/Identity.pm blib/lib/IO/Uncompress/Adapter/Identity.pm
cp lib/IO/Compress/Gzip/Constants.pm blib/lib/IO/Compress/Gzip/Constants.pm
cp lib/IO/Compress/Zlib/Extra.pm blib/lib/IO/Compress/Zlib/Extra.pm
cp lib/IO/Compress/Zip/Constants.pm blib/lib/IO/Compress/Zip/Constants.pm
cp lib/IO/Compress/Zlib/Constants.pm blib/lib/IO/Compress/Zlib/Constants.pm
cp lib/IO/Compress/Adapter/Identity.pm blib/lib/IO/Compress/Adapter/Identity.pm
cp lib/IO/Uncompress/Adapter/Inflate.pm blib/lib/IO/Uncompress/Adapter/Inflate.pm
cp lib/IO/Uncompress/Unzip.pm blib/lib/IO/Uncompress/Unzip.pm
cp lib/IO/Uncompress/Gunzip.pm blib/lib/IO/Uncompress/Gunzip.pm
cp lib/IO/Compress/RawDeflate.pm blib/lib/IO/Compress/RawDeflate.pm
cp lib/IO/Uncompress/AnyInflate.pm blib/lib/IO/Uncompress/AnyInflate.pm
cp lib/IO/Compress/Gzip.pm blib/lib/IO/Compress/Gzip.pm
Manifying blib/man3/IO::Uncompress::RawInflate.3pm
Manifying blib/man3/IO::Uncompress::Unzip.3pm
Manifying blib/man3/IO::Uncompress::Inflate.3pm
Manifying blib/man3/IO::Compress::Deflate.3pm
Manifying blib/man3/IO::Compress::Zip.3pm
Manifying blib/man3/IO::Uncompress::Gunzip.3pm
Manifying blib/man3/IO::Compress::RawDeflate.3pm
Manifying blib/man3/IO::Uncompress::AnyInflate.3pm
Manifying blib/man3/IO::Compress::Gzip.3pm
  PMQS/IO-Compress-Zlib-2.004.tar.gz
  /usr/bin/make PREFIX=~/perlmodules PREFIX=~/perlmodules -- OK
Running make test
PERL_DL_NONLAZY=1 /usr/bin/perl5.8.8 "-MExtUtils::Command::MM" "-e" "test_harness(0, 'blib/lib', 'blib/arch')" t/*.t
t/000prereq.....................
#     Failed test (t/000prereq.t at line 40)
#     Tried to use 'Compress::Raw::Zlib'.
#     Error:  Compress::Raw::Zlib version 2.004 required--this is only version 2.001 at (eval 3) line 2.
# BEGIN failed--compilation aborted at t/000prereq.t line 40.
t/000prereq.....................NOK 1/6
#     Failed test (t/000prereq.t at line 40)
#     Tried to use 'IO::Compress::Base'.
#     Error:  IO::Compress::Base version 2.004 required--this is only version 2.001 at (eval 5) line 2.
# BEGIN failed--compilation aborted at t/000prereq.t line 40.

#     Failed test (t/000prereq.t at line 40)
#     Tried to use 'IO::Uncompress::Base'.
#     Error:  IO::Uncompress::Base version 2.004 required--this is only version 2.001 at (eval 20) line 2.
# BEGIN failed--compilation aborted at t/000prereq.t line 40.
# Looks like you failed 3 tests of 6.
t/000prereq.....................dubious
        Test returned status 3 (wstat 768, 0x300)
DIED. FAILED tests 1-3
        Failed 3/6 tests, 50.00% okay
t/001zlib-generic-deflate.......IO::Compress::Base version 2.004 required--this is only version 2.001 at /root/.cpan/build/IO-Compress-Zlib-2.004-1N88d1/blib/lib/IO/Compress/RawDeflate.pm line 10.
BEGIN failed--compilation aborted at /root/.cpan/build/IO-Compress-Zlib-2.004-1N88d1/blib/lib/IO/Compress/RawDeflate.pm line 10.
Compilation failed in require at /root/.cpan/build/IO-Compress-Zlib-2.004-1N88d1/blib/lib/IO/Compress/Deflate.pm line 9.
BEGIN failed--compilation aborted at /root/.cpan/build/IO-Compress-Zlib-2.004-1N88d1/blib/lib/IO/Compress/Deflate.pm line 9.
Compilation failed in require at t/001zlib-generic-deflate.t line 12.
BEGIN failed--compilation aborted at t/001zlib-generic-deflate.t line 12.
t/001zlib-generic-deflate.......dubious
        Test returned status 9 (wstat 2304, 0x900)
t/001zlib-generic-gzip..........IO::Compress::Base version 2.004 required--this is only version 2.001 at /root/.cpan/build/IO-Compress-Zlib-2.004-1N88d1/blib/lib/IO/Compress/RawDeflate.pm line 10.
BEGIN failed--compilation aborted at /root/.cpan/build/IO-Compress-Zlib-2.004-1N88d1/blib/lib/IO/Compress/RawDeflate.pm line 10.
Compilation failed in require at /root/.cpan/build/IO-Compress-Zlib-2.004-1N88d1/blib/lib/IO/Compress/Gzip.pm line 11.
BEGIN failed--compilation aborted at /root/.cpan/build/IO-Compress-Zlib-2.004-1N88d1/blib/lib/IO/Compress/Gzip.pm line 11.
Compilation failed in require at t/001zlib-generic-gzip.t line 12.
BEGIN failed--compilation aborted at t/001zlib-generic-gzip.t line 12.
t/001zlib-generic-gzip..........dubious
        Test returned status 9 (wstat 2304, 0x900)
t/001zlib-generic-rawdeflate....IO::Compress::Base version 2.004 required--this is only version 2.001 at /root/.cpan/build/IO-Compress-Zlib-2.004-1N88d1/blib/lib/IO/Compress/RawDeflate.pm line 10.
BEGIN failed--compilation aborted at /root/.cpan/build/IO-Compress-Zlib-2.004-1N88d1/blib/lib/IO/Compress/RawDeflate.pm line 10.
Compilation failed in require at t/001zlib-generic-rawdeflate.t line 12.
BEGIN failed--compilation aborted at t/001zlib-generic-rawdeflate.t line 12.
t/001zlib-generic-rawdeflate....dubious
        Test returned status 9 (wstat 2304, 0x900)
t/001zlib-generic-zip...........IO::Compress::Base::Common version 2.004 required--this is only version 2.001 at /root/.cpan/build/IO-Compress-Zlib-2.004-1N88d1/blib/lib/IO/Compress/Zip.pm line 7.
BEGIN failed--compilation aborted at /root/.cpan/build/IO-Compress-Zlib-2.004-1N88d1/blib/lib/IO/Compress/Zip.pm line 7.
Compilation failed in require at t/001zlib-generic-zip.t line 12.
BEGIN failed--compilation aborted at t/001zlib-generic-zip.t line 12.
t/001zlib-generic-zip...........dubious
        Test returned status 255 (wstat 65280, 0xff00)
t/002any-deflate................IO::Compress::Base::Common version 2.004 required--this is only version 2.001 at /root/.cpan/build/IO-Compress-Zlib-2.004-1N88d1/blib/lib/IO/Uncompress/AnyInflate.pm line 9.
BEGIN failed--compilation aborted at /root/.cpan/build/IO-Compress-Zlib-2.004-1N88d1/blib/lib/IO/Uncompress/AnyInflate.pm line 9.
Compilation failed in require at t/002any-deflate.t line 13.
BEGIN failed--compilation aborted at t/002any-deflate.t line 13.
t/002any-deflate................dubious
        Test returned status 255 (wstat 65280, 0xff00)
t/002any-gzip...................IO::Compress::Base::Common version 2.004 required--this is only version 2.001 at /root/.cpan/build/IO-Compress-Zlib-2.004-1N88d1/blib/lib/IO/Uncompress/AnyInflate.pm line 9.
BEGIN failed--compilation aborted at /root/.cpan/build/IO-Compress-Zlib-2.004-1N88d1/blib/lib/IO/Uncompress/AnyInflate.pm line 9.
Compilation failed in require at t/002any-gzip.t line 12.
BEGIN failed--compilation aborted at t/002any-gzip.t line 12.
t/002any-gzip...................dubious
        Test returned status 255 (wstat 65280, 0xff00)
t/002any-rawdeflate.............IO::Compress::Base::Common version 2.004 required--this is only version 2.001 at /root/.cpan/build/IO-Compress-Zlib-2.004-1N88d1/blib/lib/IO/Uncompress/AnyInflate.pm line 9.
BEGIN failed--compilation aborted at /root/.cpan/build/IO-Compress-Zlib-2.004-1N88d1/blib/lib/IO/Uncompress/AnyInflate.pm line 9.
Compilation failed in require at t/002any-rawdeflate.t line 12.
BEGIN failed--compilation aborted at t/002any-rawdeflate.t line 12.
t/002any-rawdeflate.............dubious
        Test returned status 255 (wstat 65280, 0xff00)
t/002any-transparent............NOK 1/15
#     Failed test (t/002any-transparent.t at line 25)
#     Tried to use 'IO::Uncompress::AnyInflate'.
#     Error:  IO::Compress::Base::Common version 2.004 required--this is only version 2.001 at /root/.cpan/build/IO-Compress-Zlib-2.004-1N88d1/blib/lib/IO/Uncompress/AnyInflate.pm line 9.
# BEGIN failed--compilation aborted at t/002any-transparent.t line 25.
# Compilation failed in require at (eval 32) line 2.
# BEGIN failed--compilation aborted at (eval 32) line 2.
t/002any-transparent............ok 2/15Can't locate object method "new" via package "IO::Uncompress::AnyInflate" at t/002any-transparent.t line 55.
# Looks like you planned 15 tests but only ran 2.
# Looks like your test died just after 2.
t/002any-transparent............dubious
        Test returned status 255 (wstat 65280, 0xff00)
DIED. FAILED tests 1, 3-15
        Failed 14/15 tests, 6.67% okay
t/002any-zip....................IO::Compress::Base::Common version 2.004 required--this is only version 2.001 at /root/.cpan/build/IO-Compress-Zlib-2.004-1N88d1/blib/lib/IO/Uncompress/AnyInflate.pm line 9.
BEGIN failed--compilation aborted at /root/.cpan/build/IO-Compress-Zlib-2.004-1N88d1/blib/lib/IO/Uncompress/AnyInflate.pm line 9.
Compilation failed in require at t/002any-zip.t line 12.
BEGIN failed--compilation aborted at t/002any-zip.t line 12.
t/002any-zip....................dubious
        Test returned status 255 (wstat 65280, 0xff00)
t/004gziphdr....................NOK 3/910
#     Failed test (t/004gziphdr.t at line 28)
#     Tried to use 'IO::Compress::Gzip'.
#     Error:  IO::Compress::Base version 2.004 required--this is only version 2.001 at /root/.cpan/build/IO-Compress-Zlib-2.004-1N88d1/blib/lib/IO/Compress/RawDeflate.pm line 10.
# BEGIN failed--compilation aborted at t/004gziphdr.t line 28.
# Compilation failed in require at /root/.cpan/build/IO-Compress-Zlib-2.004-1N88d1/blib/lib/IO/Compress/Gzip.pm line 11.
# BEGIN failed--compilation aborted at /root/.cpan/build/IO-Compress-Zlib-2.004-1N88d1/blib/lib/IO/Compress/Gzip.pm line 11.
# Compilation failed in require at (eval 34) line 2.
# BEGIN failed--compilation aborted at (eval 34) line 2.
Global symbol "$GzipError" requires explicit package name at t/004gziphdr.t line 263.
Global symbol "$GzipError" requires explicit package name at t/004gziphdr.t line 308.
Global symbol "$GunzipError" requires explicit package name at t/004gziphdr.t line 317.
Global symbol "$GzipError" requires explicit package name at t/004gziphdr.t line 371.
Global symbol "$GzipError" requires explicit package name at t/004gziphdr.t line 424.
Global symbol "$GzipError" requires explicit package name at t/004gziphdr.t line 427.
Global symbol "$GzipError" requires explicit package name at t/004gziphdr.t line 434.
Global symbol "$GunzipError" requires explicit package name at t/004gziphdr.t line 446.
Global symbol "$GunzipError" requires explicit package name at t/004gziphdr.t line 540.
Global symbol "$GunzipError" requires explicit package name at t/004gziphdr.t line 549.
Global symbol "$GunzipError" requires explicit package name at t/004gziphdr.t line 559.
Global symbol "$GunzipError" requires explicit package name at t/004gziphdr.t line 568.
Global symbol "$GunzipError" requires explicit package name at t/004gziphdr.t line 577.
Global symbol "$GunzipError" requires explicit package name at t/004gziphdr.t line 578.
Global symbol "$GzipError" requires explicit package name at t/004gziphdr.t line 603.
Global symbol "$GzipError" requires explicit package name at t/004gziphdr.t line 612.
Global symbol "$GunzipError" requires explicit package name at t/004gziphdr.t line 623.
Global symbol "$GzipError" requires explicit package name at t/004gziphdr.t line 638.
Global symbol "$GzipError" requires explicit package name at t/004gziphdr.t line 642.
Global symbol "$GzipError" requires explicit package name at t/004gziphdr.t line 663.
Global symbol "$GunzipError" requires explicit package name at t/004gziphdr.t line 673.
Global symbol "$GzipError" requires explicit package name at t/004gziphdr.t line 687.
Global symbol "$GzipError" requires explicit package name at t/004gziphdr.t line 691.
Global symbol "$GunzipError" requires explicit package name at t/004gziphdr.t line 729.
Global symbol "$GunzipError" requires explicit package name at t/004gziphdr.t line 754.
Global symbol "$GunzipError" requires explicit package name at t/004gziphdr.t line 780.
Global symbol "$GunzipError" requires explicit package name at t/004gziphdr.t line 805.
Global symbol "$GunzipError" requires explicit package name at t/004gziphdr.t line 851.
Global symbol "$GunzipError" requires explicit package name at t/004gziphdr.t line 856.
Global symbol "$GunzipError" requires explicit package name at t/004gziphdr.t line 883.
Global symbol "$GunzipError" requires explicit package name at t/004gziphdr.t line 888.
Global symbol "$GunzipError" requires explicit package name at t/004gziphdr.t line 914.
Global symbol "$GunzipError" requires explicit package name at t/004gziphdr.t line 919.
Global symbol "$GunzipError" requires explicit package name at t/004gziphdr.t line 946.
Global symbol "$GunzipError" requires explicit package name at t/004gziphdr.t line 951.
Execution of t/004gziphdr.t aborted due to compilation errors.
# Looks like you planned 910 tests but only ran 4.
# Looks like your test died just after 4.
t/004gziphdr....................dubious
        Test returned status 255 (wstat 65280, 0xff00)
DIED. FAILED tests 3, 5-910
        Failed 907/910 tests, 0.33% okay
t/005defhdr.....................NOK 2/595
#     Failed test (t/005defhdr.t at line 26)
#     Tried to use 'IO::Compress::Deflate'.
#     Error:  IO::Compress::Base version 2.004 required--this is only version 2.001 at /root/.cpan/build/IO-Compress-Zlib-2.004-1N88d1/blib/lib/IO/Compress/RawDeflate.pm line 10.
# BEGIN failed--compilation aborted at t/005defhdr.t line 26.
# Compilation failed in require at /root/.cpan/build/IO-Compress-Zlib-2.004-1N88d1/blib/lib/IO/Compress/Deflate.pm line 9.
# BEGIN failed--compilation aborted at /root/.cpan/build/IO-Compress-Zlib-2.004-1N88d1/blib/lib/IO/Compress/Deflate.pm line 9.
# Compilation failed in require at (eval 33) line 2.
# BEGIN failed--compilation aborted at (eval 33) line 2.
Can't locate object method "new" via package "IO::Compress::Deflate" at t/005defhdr.t line 40.
# Looks like you planned 595 tests but only ran 5.
# Looks like your test died just after 5.
t/005defhdr.....................dubious
        Test returned status 255 (wstat 65280, 0xff00)
DIED. FAILED tests 2, 6-595
        Failed 591/595 tests, 0.67% okay
t/010examples...................IO::Compress::Base version 2.004 required--this is only version 2.001 at /root/.cpan/build/IO-Compress-Zlib-2.004-1N88d1/blib/lib/IO/Compress/RawDeflate.pm line 10.
BEGIN failed--compilation aborted at /root/.cpan/build/IO-Compress-Zlib-2.004-1N88d1/blib/lib/IO/Compress/RawDeflate.pm line 10.
Compilation failed in require at /root/.cpan/build/IO-Compress-Zlib-2.004-1N88d1/blib/lib/IO/Compress/Gzip.pm line 11.
BEGIN failed--compilation aborted at /root/.cpan/build/IO-Compress-Zlib-2.004-1N88d1/blib/lib/IO/Compress/Gzip.pm line 11.
Compilation failed in require at t/010examples.t line 16.
BEGIN failed--compilation aborted at t/010examples.t line 16.
# Looks like your test died before it could output anything.
t/010examples...................dubious
        Test returned status 255 (wstat 65280, 0xff00)
t/020isize......................skipped
        all skipped: Lengthy Tests Disabled
t/050interop-gzip...............NOK 1/7
#     Failed test (t/050interop-gzip.t at line 112)
#     Tried to use 'IO::Compress::Gzip'.
#     Error:  IO::Compress::Base version 2.004 required--this is only version 2.001 at /root/.cpan/build/IO-Compress-Zlib-2.004-1N88d1/blib/lib/IO/Compress/RawDeflate.pm line 10.
# BEGIN failed--compilation aborted at t/050interop-gzip.t line 112.
# Compilation failed in require at /root/.cpan/build/IO-Compress-Zlib-2.004-1N88d1/blib/lib/IO/Compress/Gzip.pm line 11.
# BEGIN failed--compilation aborted at /root/.cpan/build/IO-Compress-Zlib-2.004-1N88d1/blib/lib/IO/Compress/Gzip.pm line 11.
# Compilation failed in require at (eval 32) line 2.
# BEGIN failed--compilation aborted at (eval 32) line 2.
t/050interop-gzip...............ok 2/7Backslash found where operator expected at t/050interop-gzip.t line 137, near "gzip \"
        (Do you need to predeclare gzip?)
syntax error at t/050interop-gzip.t line 137, near "gzip \"
Execution of t/050interop-gzip.t aborted due to compilation errors.
# Looks like you planned 7 tests but only ran 2.
# Looks like your test died just after 2.
t/050interop-gzip...............dubious
        Test returned status 255 (wstat 65280, 0xff00)
DIED. FAILED tests 1, 3-7
        Failed 6/7 tests, 14.29% okay
t/100generic-deflate............IO::Compress::Base version 2.004 required--this is only version 2.001 at /root/.cpan/build/IO-Compress-Zlib-2.004-1N88d1/blib/lib/IO/Compress/RawDeflate.pm line 10.
BEGIN failed--compilation aborted at /root/.cpan/build/IO-Compress-Zlib-2.004-1N88d1/blib/lib/IO/Compress/RawDeflate.pm line 10.
Compilation failed in require at /root/.cpan/build/IO-Compress-Zlib-2.004-1N88d1/blib/lib/IO/Compress/Deflate.pm line 9.
BEGIN failed--compilation aborted at /root/.cpan/build/IO-Compress-Zlib-2.004-1N88d1/blib/lib/IO/Compress/Deflate.pm line 9.
Compilation failed in require at t/100generic-deflate.t line 13.
BEGIN failed--compilation aborted at t/100generic-deflate.t line 13.
t/100generic-deflate............dubious
        Test returned status 9 (wstat 2304, 0x900)
t/100generic-gzip...............IO::Compress::Base version 2.004 required--this is only version 2.001 at /root/.cpan/build/IO-Compress-Zlib-2.004-1N88d1/blib/lib/IO/Compress/RawDeflate.pm line 10.
BEGIN failed--compilation aborted at /root/.cpan/build/IO-Compress-Zlib-2.004-1N88d1/blib/lib/IO/Compress/RawDeflate.pm line 10.
Compilation failed in require at /root/.cpan/build/IO-Compress-Zlib-2.004-1N88d1/blib/lib/IO/Compress/Gzip.pm line 11.
BEGIN failed--compilation aborted at /root/.cpan/build/IO-Compress-Zlib-2.004-1N88d1/blib/lib/IO/Compress/Gzip.pm line 11.
Compilation failed in require at t/100generic-gzip.t line 12.
BEGIN failed--compilation aborted at t/100generic-gzip.t line 12.
t/100generic-gzip...............dubious
        Test returned status 9 (wstat 2304, 0x900)
t/100generic-rawdeflate.........IO::Compress::Base version 2.004 required--this is only version 2.001 at /root/.cpan/build/IO-Compress-Zlib-2.004-1N88d1/blib/lib/IO/Compress/RawDeflate.pm line 10.
BEGIN failed--compilation aborted at /root/.cpan/build/IO-Compress-Zlib-2.004-1N88d1/blib/lib/IO/Compress/RawDeflate.pm line 10.
Compilation failed in require at t/100generic-rawdeflate.t line 12.
BEGIN failed--compilation aborted at t/100generic-rawdeflate.t line 12.
t/100generic-rawdeflate.........dubious
        Test returned status 9 (wstat 2304, 0x900)
t/100generic-zip................IO::Compress::Base::Common version 2.004 required--this is only version 2.001 at /root/.cpan/build/IO-Compress-Zlib-2.004-1N88d1/blib/lib/IO/Compress/Zip.pm line 7.
BEGIN failed--compilation aborted at /root/.cpan/build/IO-Compress-Zlib-2.004-1N88d1/blib/lib/IO/Compress/Zip.pm line 7.
Compilation failed in require at t/100generic-zip.t line 12.
BEGIN failed--compilation aborted at t/100generic-zip.t line 12.
t/100generic-zip................dubious
        Test returned status 255 (wstat 65280, 0xff00)
t/101truncate-deflate...........IO::Compress::Base version 2.004 required--this is only version 2.001 at /root/.cpan/build/IO-Compress-Zlib-2.004-1N88d1/blib/lib/IO/Compress/RawDeflate.pm line 10.
BEGIN failed--compilation aborted at /root/.cpan/build/IO-Compress-Zlib-2.004-1N88d1/blib/lib/IO/Compress/RawDeflate.pm line 10.
Compilation failed in require at /root/.cpan/build/IO-Compress-Zlib-2.004-1N88d1/blib/lib/IO/Compress/Deflate.pm line 9.
BEGIN failed--compilation aborted at /root/.cpan/build/IO-Compress-Zlib-2.004-1N88d1/blib/lib/IO/Compress/Deflate.pm line 9.
Compilation failed in require at t/101truncate-deflate.t line 28.
BEGIN failed--compilation aborted at t/101truncate-deflate.t line 28.
# Looks like your test died before it could output anything.
t/101truncate-deflate...........dubious
        Test returned status 255 (wstat 65280, 0xff00)
DIED. FAILED tests 1-734
        Failed 734/734 tests, 0.00% okay
t/101truncate-gzip..............IO::Compress::Base version 2.004 required--this is only version 2.001 at /root/.cpan/build/IO-Compress-Zlib-2.004-1N88d1/blib/lib/IO/Compress/RawDeflate.pm line 10.
BEGIN failed--compilation aborted at /root/.cpan/build/IO-Compress-Zlib-2.004-1N88d1/blib/lib/IO/Compress/RawDeflate.pm line 10.
Compilation failed in require at /root/.cpan/build/IO-Compress-Zlib-2.004-1N88d1/blib/lib/IO/Compress/Gzip.pm line 11.
BEGIN failed--compilation aborted at /root/.cpan/build/IO-Compress-Zlib-2.004-1N88d1/blib/lib/IO/Compress/Gzip.pm line 11.
Compilation failed in require at t/101truncate-gzip.t line 27.
BEGIN failed--compilation aborted at t/101truncate-gzip.t line 27.
# Looks like your test died before it could output anything.
t/101truncate-gzip..............dubious
        Test returned status 255 (wstat 65280, 0xff00)
DIED. FAILED tests 1-978
        Failed 978/978 tests, 0.00% okay
t/101truncate-rawdeflate........IO::Compress::Base version 2.004 required--this is only version 2.001 at /root/.cpan/build/IO-Compress-Zlib-2.004-1N88d1/blib/lib/IO/Compress/RawDeflate.pm line 10.
BEGIN failed--compilation aborted at /root/.cpan/build/IO-Compress-Zlib-2.004-1N88d1/blib/lib/IO/Compress/RawDeflate.pm line 10.
Compilation failed in require at t/101truncate-rawdeflate.t line 25.
BEGIN failed--compilation aborted at t/101truncate-rawdeflate.t line 25.
# Looks like your test died before it could output anything.
t/101truncate-rawdeflate........dubious
        Test returned status 255 (wstat 65280, 0xff00)
DIED. FAILED tests 1-625
        Failed 625/625 tests, 0.00% okay
t/101truncate-zip...............IO::Compress::Base::Common version 2.004 required--this is only version 2.001 at /root/.cpan/build/IO-Compress-Zlib-2.004-1N88d1/blib/lib/IO/Compress/Zip.pm line 7.
BEGIN failed--compilation aborted at /root/.cpan/build/IO-Compress-Zlib-2.004-1N88d1/blib/lib/IO/Compress/Zip.pm line 7.
Compilation failed in require at t/101truncate-zip.t line 29.
BEGIN failed--compilation aborted at t/101truncate-zip.t line 29.
# Looks like your test died before it could output anything.
t/101truncate-zip...............dubious
        Test returned status 255 (wstat 65280, 0xff00)
DIED. FAILED tests 1-2316
        Failed 2316/2316 tests, 0.00% okay
t/102tied-deflate...............IO::Compress::Base version 2.004 required--this is only version 2.001 at /root/.cpan/build/IO-Compress-Zlib-2.004-1N88d1/blib/lib/IO/Compress/RawDeflate.pm line 10.
BEGIN failed--compilation aborted at /root/.cpan/build/IO-Compress-Zlib-2.004-1N88d1/blib/lib/IO/Compress/RawDeflate.pm line 10.
Compilation failed in require at /root/.cpan/build/IO-Compress-Zlib-2.004-1N88d1/blib/lib/IO/Compress/Deflate.pm line 9.
BEGIN failed--compilation aborted at /root/.cpan/build/IO-Compress-Zlib-2.004-1N88d1/blib/lib/IO/Compress/Deflate.pm line 9.
Compilation failed in require at t/102tied-deflate.t line 12.
BEGIN failed--compilation aborted at t/102tied-deflate.t line 12.
t/102tied-deflate...............dubious
        Test returned status 9 (wstat 2304, 0x900)
t/102tied-gzip..................IO::Compress::Base version 2.004 required--this is only version 2.001 at /root/.cpan/build/IO-Compress-Zlib-2.004-1N88d1/blib/lib/IO/Compress/RawDeflate.pm line 10.
BEGIN failed--compilation aborted at /root/.cpan/build/IO-Compress-Zlib-2.004-1N88d1/blib/lib/IO/Compress/RawDeflate.pm line 10.
Compilation failed in require at /root/.cpan/build/IO-Compress-Zlib-2.004-1N88d1/blib/lib/IO/Compress/Gzip.pm line 11.
BEGIN failed--compilation aborted at /root/.cpan/build/IO-Compress-Zlib-2.004-1N88d1/blib/lib/IO/Compress/Gzip.pm line 11.
Compilation failed in require at t/102tied-gzip.t line 12.
BEGIN failed--compilation aborted at t/102tied-gzip.t line 12.
t/102tied-gzip..................dubious
        Test returned status 9 (wstat 2304, 0x900)
t/102tied-rawdeflate............IO::Compress::Base version 2.004 required--this is only version 2.001 at /root/.cpan/build/IO-Compress-Zlib-2.004-1N88d1/blib/lib/IO/Compress/RawDeflate.pm line 10.
BEGIN failed--compilation aborted at /root/.cpan/build/IO-Compress-Zlib-2.004-1N88d1/blib/lib/IO/Compress/RawDeflate.pm line 10.
Compilation failed in require at t/102tied-rawdeflate.t line 12.
BEGIN failed--compilation aborted at t/102tied-rawdeflate.t line 12.
t/102tied-rawdeflate............dubious
        Test returned status 9 (wstat 2304, 0x900)
t/102tied-zip...................IO::Compress::Base::Common version 2.004 required--this is only version 2.001 at /root/.cpan/build/IO-Compress-Zlib-2.004-1N88d1/blib/lib/IO/Compress/Zip.pm line 7.
BEGIN failed--compilation aborted at /root/.cpan/build/IO-Compress-Zlib-2.004-1N88d1/blib/lib/IO/Compress/Zip.pm line 7.
Compilation failed in require at t/102tied-zip.t line 12.
BEGIN failed--compilation aborted at t/102tied-zip.t line 12.
t/102tied-zip...................dubious
        Test returned status 255 (wstat 65280, 0xff00)
t/103newtied-deflate............IO::Compress::Base version 2.004 required--this is only version 2.001 at /root/.cpan/build/IO-Compress-Zlib-2.004-1N88d1/blib/lib/IO/Compress/RawDeflate.pm line 10.
BEGIN failed--compilation aborted at /root/.cpan/build/IO-Compress-Zlib-2.004-1N88d1/blib/lib/IO/Compress/RawDeflate.pm line 10.
Compilation failed in require at /root/.cpan/build/IO-Compress-Zlib-2.004-1N88d1/blib/lib/IO/Compress/Deflate.pm line 9.
BEGIN failed--compilation aborted at /root/.cpan/build/IO-Compress-Zlib-2.004-1N88d1/blib/lib/IO/Compress/Deflate.pm line 9.
Compilation failed in require at t/103newtied-deflate.t line 12.
BEGIN failed--compilation aborted at t/103newtied-deflate.t line 12.
t/103newtied-deflate............dubious
        Test returned status 9 (wstat 2304, 0x900)
t/103newtied-gzip...............IO::Compress::Base version 2.004 required--this is only version 2.001 at /root/.cpan/build/IO-Compress-Zlib-2.004-1N88d1/blib/lib/IO/Compress/RawDeflate.pm line 10.
BEGIN failed--compilation aborted at /root/.cpan/build/IO-Compress-Zlib-2.004-1N88d1/blib/lib/IO/Compress/RawDeflate.pm line 10.
Compilation failed in require at /root/.cpan/build/IO-Compress-Zlib-2.004-1N88d1/blib/lib/IO/Compress/Gzip.pm line 11.
BEGIN failed--compilation aborted at /root/.cpan/build/IO-Compress-Zlib-2.004-1N88d1/blib/lib/IO/Compress/Gzip.pm line 11.
Compilation failed in require at t/103newtied-gzip.t line 12.
BEGIN failed--compilation aborted at t/103newtied-gzip.t line 12.
t/103newtied-gzip...............dubious
        Test returned status 9 (wstat 2304, 0x900)
t/103newtied-rawdeflate.........IO::Compress::Base version 2.004 required--this is only version 2.001 at /root/.cpan/build/IO-Compress-Zlib-2.004-1N88d1/blib/lib/IO/Compress/RawDeflate.pm line 10.
BEGIN failed--compilation aborted at /root/.cpan/build/IO-Compress-Zlib-2.004-1N88d1/blib/lib/IO/Compress/RawDeflate.pm line 10.
Compilation failed in require at t/103newtied-rawdeflate.t line 12.
BEGIN failed--compilation aborted at t/103newtied-rawdeflate.t line 12.
t/103newtied-rawdeflate.........dubious
        Test returned status 9 (wstat 2304, 0x900)
t/103newtied-zip................IO::Compress::Base::Common version 2.004 required--this is only version 2.001 at /root/.cpan/build/IO-Compress-Zlib-2.004-1N88d1/blib/lib/IO/Compress/Zip.pm line 7.
BEGIN failed--compilation aborted at /root/.cpan/build/IO-Compress-Zlib-2.004-1N88d1/blib/lib/IO/Compress/Zip.pm line 7.
Compilation failed in require at t/103newtied-zip.t line 12.
BEGIN failed--compilation aborted at t/103newtied-zip.t line 12.
t/103newtied-zip................dubious
        Test returned status 255 (wstat 65280, 0xff00)
t/104destroy-deflate............IO::Compress::Base version 2.004 required--this is only version 2.001 at /root/.cpan/build/IO-Compress-Zlib-2.004-1N88d1/blib/lib/IO/Compress/RawDeflate.pm line 10.
BEGIN failed--compilation aborted at /root/.cpan/build/IO-Compress-Zlib-2.004-1N88d1/blib/lib/IO/Compress/RawDeflate.pm line 10.
Compilation failed in require at /root/.cpan/build/IO-Compress-Zlib-2.004-1N88d1/blib/lib/IO/Compress/Deflate.pm line 9.
BEGIN failed--compilation aborted at /root/.cpan/build/IO-Compress-Zlib-2.004-1N88d1/blib/lib/IO/Compress/Deflate.pm line 9.
Compilation failed in require at t/104destroy-deflate.t line 12.
BEGIN failed--compilation aborted at t/104destroy-deflate.t line 12.
t/104destroy-deflate............dubious
        Test returned status 9 (wstat 2304, 0x900)
t/104destroy-gzip...............IO::Compress::Base version 2.004 required--this is only version 2.001 at /root/.cpan/build/IO-Compress-Zlib-2.004-1N88d1/blib/lib/IO/Compress/RawDeflate.pm line 10.
BEGIN failed--compilation aborted at /root/.cpan/build/IO-Compress-Zlib-2.004-1N88d1/blib/lib/IO/Compress/RawDeflate.pm line 10.
Compilation failed in require at /root/.cpan/build/IO-Compress-Zlib-2.004-1N88d1/blib/lib/IO/Compress/Gzip.pm line 11.
BEGIN failed--compilation aborted at /root/.cpan/build/IO-Compress-Zlib-2.004-1N88d1/blib/lib/IO/Compress/Gzip.pm line 11.
Compilation failed in require at t/104destroy-gzip.t line 12.
BEGIN failed--compilation aborted at t/104destroy-gzip.t line 12.
t/104destroy-gzip...............dubious
        Test returned status 9 (wstat 2304, 0x900)
t/104destroy-rawdeflate.........IO::Compress::Base version 2.004 required--this is only version 2.001 at /root/.cpan/build/IO-Compress-Zlib-2.004-1N88d1/blib/lib/IO/Compress/RawDeflate.pm line 10.
BEGIN failed--compilation aborted at /root/.cpan/build/IO-Compress-Zlib-2.004-1N88d1/blib/lib/IO/Compress/RawDeflate.pm line 10.
Compilation failed in require at t/104destroy-rawdeflate.t line 12.
BEGIN failed--compilation aborted at t/104destroy-rawdeflate.t line 12.
t/104destroy-rawdeflate.........dubious
        Test returned status 9 (wstat 2304, 0x900)
t/104destroy-zip................IO::Compress::Base::Common version 2.004 required--this is only version 2.001 at /root/.cpan/build/IO-Compress-Zlib-2.004-1N88d1/blib/lib/IO/Compress/Zip.pm line 7.
BEGIN failed--compilation aborted at /root/.cpan/build/IO-Compress-Zlib-2.004-1N88d1/blib/lib/IO/Compress/Zip.pm line 7.
Compilation failed in require at t/104destroy-zip.t line 12.
BEGIN failed--compilation aborted at t/104destroy-zip.t line 12.
t/104destroy-zip................dubious
        Test returned status 255 (wstat 65280, 0xff00)
t/105oneshot-deflate............IO::Compress::Base version 2.004 required--this is only version 2.001 at /root/.cpan/build/IO-Compress-Zlib-2.004-1N88d1/blib/lib/IO/Compress/RawDeflate.pm line 10.
BEGIN failed--compilation aborted at /root/.cpan/build/IO-Compress-Zlib-2.004-1N88d1/blib/lib/IO/Compress/RawDeflate.pm line 10.
Compilation failed in require at /root/.cpan/build/IO-Compress-Zlib-2.004-1N88d1/blib/lib/IO/Compress/Deflate.pm line 9.
BEGIN failed--compilation aborted at /root/.cpan/build/IO-Compress-Zlib-2.004-1N88d1/blib/lib/IO/Compress/Deflate.pm line 9.
Compilation failed in require at t/105oneshot-deflate.t line 12.
BEGIN failed--compilation aborted at t/105oneshot-deflate.t line 12.
t/105oneshot-deflate............dubious
        Test returned status 9 (wstat 2304, 0x900)
t/105oneshot-gzip-only..........NOK 1/70
#     Failed test (t/105oneshot-gzip-only.t at line 28)
#     Tried to use 'IO::Compress::Gzip'.
#     Error:  IO::Compress::Base version 2.004 required--this is only version 2.001 at /root/.cpan/build/IO-Compress-Zlib-2.004-1N88d1/blib/lib/IO/Compress/RawDeflate.pm line 10.
# BEGIN failed--compilation aborted at t/105oneshot-gzip-only.t line 28.
# Compilation failed in require at /root/.cpan/build/IO-Compress-Zlib-2.004-1N88d1/blib/lib/IO/Compress/Gzip.pm line 11.
# BEGIN failed--compilation aborted at /root/.cpan/build/IO-Compress-Zlib-2.004-1N88d1/blib/lib/IO/Compress/Gzip.pm line 11.
# Compilation failed in require at (eval 32) line 2.
# BEGIN failed--compilation aborted at (eval 32) line 2.
t/105oneshot-gzip-only..........ok 2/70Global symbol "$GunzipError" requires explicit package name at t/105oneshot-gzip-only.t line 46.
Execution of t/105oneshot-gzip-only.t aborted due to compilation errors.
# Looks like you planned 70 tests but only ran 2.
# Looks like your test died just after 2.
t/105oneshot-gzip-only..........dubious
        Test returned status 255 (wstat 65280, 0xff00)
DIED. FAILED tests 1, 3-70
        Failed 69/70 tests, 1.43% okay
t/105oneshot-gzip...............IO::Compress::Base version 2.004 required--this is only version 2.001 at /root/.cpan/build/IO-Compress-Zlib-2.004-1N88d1/blib/lib/IO/Compress/RawDeflate.pm line 10.
BEGIN failed--compilation aborted at /root/.cpan/build/IO-Compress-Zlib-2.004-1N88d1/blib/lib/IO/Compress/RawDeflate.pm line 10.
Compilation failed in require at /root/.cpan/build/IO-Compress-Zlib-2.004-1N88d1/blib/lib/IO/Compress/Gzip.pm line 11.
BEGIN failed--compilation aborted at /root/.cpan/build/IO-Compress-Zlib-2.004-1N88d1/blib/lib/IO/Compress/Gzip.pm line 11.
Compilation failed in require at t/105oneshot-gzip.t line 12.
BEGIN failed--compilation aborted at t/105oneshot-gzip.t line 12.
t/105oneshot-gzip...............dubious
        Test returned status 9 (wstat 2304, 0x900)
t/105oneshot-rawdeflate.........IO::Compress::Base version 2.004 required--this is only version 2.001 at /root/.cpan/build/IO-Compress-Zlib-2.004-1N88d1/blib/lib/IO/Compress/RawDeflate.pm line 10.
BEGIN failed--compilation aborted at /root/.cpan/build/IO-Compress-Zlib-2.004-1N88d1/blib/lib/IO/Compress/RawDeflate.pm line 10.
Compilation failed in require at t/105oneshot-rawdeflate.t line 12.
BEGIN failed--compilation aborted at t/105oneshot-rawdeflate.t line 12.
t/105oneshot-rawdeflate.........dubious
        Test returned status 9 (wstat 2304, 0x900)
t/105oneshot-zip-bzip2-only.....skipped
        all skipped: IO::Compress::Bzip2 not available
t/105oneshot-zip-only...........NOK 1/146
#     Failed test (t/105oneshot-zip-only.t at line 29)
#     Tried to use 'IO::Compress::Zip'.
#     Error:  IO::Compress::Base::Common version 2.004 required--this is only version 2.001 at /root/.cpan/build/IO-Compress-Zlib-2.004-1N88d1/blib/lib/IO/Compress/Zip.pm line 7.
# BEGIN failed--compilation aborted at t/105oneshot-zip-only.t line 29.
# Compilation failed in require at (eval 32) line 2.
# BEGIN failed--compilation aborted at (eval 32) line 2.
t/105oneshot-zip-only...........ok 2/146Global symbol "$UnzipError" requires explicit package name at t/105oneshot-zip-only.t line 47.
Global symbol "$ZipError" requires explicit package name at t/105oneshot-zip-only.t line 158.
Global symbol "$UnzipError" requires explicit package name at t/105oneshot-zip-only.t line 164.
Global symbol "$UnzipError" requires explicit package name at t/105oneshot-zip-only.t line 170.
Global symbol "$ZipError" requires explicit package name at t/105oneshot-zip-only.t line 175.
Global symbol "$ZipError" requires explicit package name at t/105oneshot-zip-only.t line 214.
Global symbol "$UnzipError" requires explicit package name at t/105oneshot-zip-only.t line 222.
Global symbol "$UnzipError" requires explicit package name at t/105oneshot-zip-only.t line 228.
Bareword "ZIP_CM_STORE" not allowed while "strict subs" in use at t/105oneshot-zip-only.t line 142.
Bareword "ZIP_CM_DEFLATE" not allowed while "strict subs" in use at t/105oneshot-zip-only.t line 142.
Bareword "ZIP_CM_STORE" not allowed while "strict subs" in use at t/105oneshot-zip-only.t line 161.
Bareword "ZIP_CM_STORE" not allowed while "strict subs" in use at t/105oneshot-zip-only.t line 192.
Bareword "ZIP_CM_DEFLATE" not allowed while "strict subs" in use at t/105oneshot-zip-only.t line 192.
Bareword "ZIP_CM_STORE" not allowed while "strict subs" in use at t/105oneshot-zip-only.t line 219.
Execution of t/105oneshot-zip-only.t aborted due to compilation errors.
# Looks like you planned 146 tests but only ran 2.
# Looks like your test died just after 2.
t/105oneshot-zip-only...........dubious
        Test returned status 255 (wstat 65280, 0xff00)
DIED. FAILED tests 1, 3-146
        Failed 145/146 tests, 0.68% okay
t/105oneshot-zip................IO::Compress::Base::Common version 2.004 required--this is only version 2.001 at /root/.cpan/build/IO-Compress-Zlib-2.004-1N88d1/blib/lib/IO/Compress/Zip.pm line 7.
BEGIN failed--compilation aborted at /root/.cpan/build/IO-Compress-Zlib-2.004-1N88d1/blib/lib/IO/Compress/Zip.pm line 7.
Compilation failed in require at t/105oneshot-zip.t line 12.
BEGIN failed--compilation aborted at t/105oneshot-zip.t line 12.
t/105oneshot-zip................dubious
        Test returned status 255 (wstat 65280, 0xff00)
t/106prime-deflate..............IO::Compress::Base version 2.004 required--this is only version 2.001 at /root/.cpan/build/IO-Compress-Zlib-2.004-1N88d1/blib/lib/IO/Compress/RawDeflate.pm line 10.
BEGIN failed--compilation aborted at /root/.cpan/build/IO-Compress-Zlib-2.004-1N88d1/blib/lib/IO/Compress/RawDeflate.pm line 10.
Compilation failed in require at /root/.cpan/build/IO-Compress-Zlib-2.004-1N88d1/blib/lib/IO/Compress/Deflate.pm line 9.
BEGIN failed--compilation aborted at /root/.cpan/build/IO-Compress-Zlib-2.004-1N88d1/blib/lib/IO/Compress/Deflate.pm line 9.
Compilation failed in require at t/106prime-deflate.t line 12.
BEGIN failed--compilation aborted at t/106prime-deflate.t line 12.
t/106prime-deflate..............dubious
        Test returned status 9 (wstat 2304, 0x900)
t/106prime-gzip.................IO::Compress::Base version 2.004 required--this is only version 2.001 at /root/.cpan/build/IO-Compress-Zlib-2.004-1N88d1/blib/lib/IO/Compress/RawDeflate.pm line 10.
BEGIN failed--compilation aborted at /root/.cpan/build/IO-Compress-Zlib-2.004-1N88d1/blib/lib/IO/Compress/RawDeflate.pm line 10.
Compilation failed in require at /root/.cpan/build/IO-Compress-Zlib-2.004-1N88d1/blib/lib/IO/Compress/Gzip.pm line 11.
BEGIN failed--compilation aborted at /root/.cpan/build/IO-Compress-Zlib-2.004-1N88d1/blib/lib/IO/Compress/Gzip.pm line 11.
Compilation failed in require at t/106prime-gzip.t line 12.
BEGIN failed--compilation aborted at t/106prime-gzip.t line 12.
t/106prime-gzip.................dubious
        Test returned status 9 (wstat 2304, 0x900)
t/106prime-rawdeflate...........IO::Compress::Base version 2.004 required--this is only version 2.001 at /root/.cpan/build/IO-Compress-Zlib-2.004-1N88d1/blib/lib/IO/Compress/RawDeflate.pm line 10.
BEGIN failed--compilation aborted at /root/.cpan/build/IO-Compress-Zlib-2.004-1N88d1/blib/lib/IO/Compress/RawDeflate.pm line 10.
Compilation failed in require at t/106prime-rawdeflate.t line 12.
BEGIN failed--compilation aborted at t/106prime-rawdeflate.t line 12.
t/106prime-rawdeflate...........dubious
        Test returned status 9 (wstat 2304, 0x900)
t/106prime-zip..................IO::Compress::Base::Common version 2.004 required--this is only version 2.001 at /root/.cpan/build/IO-Compress-Zlib-2.004-1N88d1/blib/lib/IO/Compress/Zip.pm line 7.
BEGIN failed--compilation aborted at /root/.cpan/build/IO-Compress-Zlib-2.004-1N88d1/blib/lib/IO/Compress/Zip.pm line 7.
Compilation failed in require at t/106prime-zip.t line 12.
BEGIN failed--compilation aborted at t/106prime-zip.t line 12.
t/106prime-zip..................dubious
        Test returned status 255 (wstat 65280, 0xff00)
t/107multi-deflate..............IO::Compress::Base version 2.004 required--this is only version 2.001 at /root/.cpan/build/IO-Compress-Zlib-2.004-1N88d1/blib/lib/IO/Compress/RawDeflate.pm line 10.
BEGIN failed--compilation aborted at /root/.cpan/build/IO-Compress-Zlib-2.004-1N88d1/blib/lib/IO/Compress/RawDeflate.pm line 10.
Compilation failed in require at /root/.cpan/build/IO-Compress-Zlib-2.004-1N88d1/blib/lib/IO/Compress/Deflate.pm line 9.
BEGIN failed--compilation aborted at /root/.cpan/build/IO-Compress-Zlib-2.004-1N88d1/blib/lib/IO/Compress/Deflate.pm line 9.
Compilation failed in require at t/107multi-deflate.t line 12.
BEGIN failed--compilation aborted at t/107multi-deflate.t line 12.
t/107multi-deflate..............dubious
        Test returned status 9 (wstat 2304, 0x900)
t/107multi-gzip.................IO::Compress::Base version 2.004 required--this is only version 2.001 at /root/.cpan/build/IO-Compress-Zlib-2.004-1N88d1/blib/lib/IO/Compress/RawDeflate.pm line 10.
BEGIN failed--compilation aborted at /root/.cpan/build/IO-Compress-Zlib-2.004-1N88d1/blib/lib/IO/Compress/RawDeflate.pm line 10.
Compilation failed in require at /root/.cpan/build/IO-Compress-Zlib-2.004-1N88d1/blib/lib/IO/Compress/Gzip.pm line 11.
BEGIN failed--compilation aborted at /root/.cpan/build/IO-Compress-Zlib-2.004-1N88d1/blib/lib/IO/Compress/Gzip.pm line 11.
Compilation failed in require at t/107multi-gzip.t line 12.
BEGIN failed--compilation aborted at t/107multi-gzip.t line 12.
t/107multi-gzip.................dubious
        Test returned status 9 (wstat 2304, 0x900)
t/107multi-rawdeflate...........IO::Compress::Base version 2.004 required--this is only version 2.001 at /root/.cpan/build/IO-Compress-Zlib-2.004-1N88d1/blib/lib/IO/Compress/RawDeflate.pm line 10.
BEGIN failed--compilation aborted at /root/.cpan/build/IO-Compress-Zlib-2.004-1N88d1/blib/lib/IO/Compress/RawDeflate.pm line 10.
Compilation failed in require at t/107multi-rawdeflate.t line 12.
BEGIN failed--compilation aborted at t/107multi-rawdeflate.t line 12.
t/107multi-rawdeflate...........dubious
        Test returned status 9 (wstat 2304, 0x900)
t/107multi-zip..................IO::Compress::Base::Common version 2.004 required--this is only version 2.001 at /root/.cpan/build/IO-Compress-Zlib-2.004-1N88d1/blib/lib/IO/Compress/Zip.pm line 7.
BEGIN failed--compilation aborted at /root/.cpan/build/IO-Compress-Zlib-2.004-1N88d1/blib/lib/IO/Compress/Zip.pm line 7.
Compilation failed in require at t/107multi-zip.t line 12.
BEGIN failed--compilation aborted at t/107multi-zip.t line 12.
t/107multi-zip..................dubious
        Test returned status 255 (wstat 65280, 0xff00)
t/108anyunc-deflate.............IO::Compress::Base version 2.004 required--this is only version 2.001 at /root/.cpan/build/IO-Compress-Zlib-2.004-1N88d1/blib/lib/IO/Compress/RawDeflate.pm line 10.
BEGIN failed--compilation aborted at /root/.cpan/build/IO-Compress-Zlib-2.004-1N88d1/blib/lib/IO/Compress/RawDeflate.pm line 10.
Compilation failed in require at /root/.cpan/build/IO-Compress-Zlib-2.004-1N88d1/blib/lib/IO/Compress/Deflate.pm line 9.
BEGIN failed--compilation aborted at /root/.cpan/build/IO-Compress-Zlib-2.004-1N88d1/blib/lib/IO/Compress/Deflate.pm line 9.
Compilation failed in require at t/108anyunc-deflate.t line 14.
BEGIN failed--compilation aborted at t/108anyunc-deflate.t line 14.
t/108anyunc-deflate.............dubious
        Test returned status 9 (wstat 2304, 0x900)
t/108anyunc-gzip................IO::Compress::Base version 2.004 required--this is only version 2.001 at /root/.cpan/build/IO-Compress-Zlib-2.004-1N88d1/blib/lib/IO/Compress/RawDeflate.pm line 10.
BEGIN failed--compilation aborted at /root/.cpan/build/IO-Compress-Zlib-2.004-1N88d1/blib/lib/IO/Compress/RawDeflate.pm line 10.
Compilation failed in require at /root/.cpan/build/IO-Compress-Zlib-2.004-1N88d1/blib/lib/IO/Compress/Gzip.pm line 11.
BEGIN failed--compilation aborted at /root/.cpan/build/IO-Compress-Zlib-2.004-1N88d1/blib/lib/IO/Compress/Gzip.pm line 11.
Compilation failed in require at t/108anyunc-gzip.t line 14.
BEGIN failed--compilation aborted at t/108anyunc-gzip.t line 14.
t/108anyunc-gzip................dubious
        Test returned status 9 (wstat 2304, 0x900)
t/108anyunc-rawdeflate..........IO::Compress::Base version 2.004 required--this is only version 2.001 at /root/.cpan/build/IO-Compress-Zlib-2.004-1N88d1/blib/lib/IO/Compress/RawDeflate.pm line 10.
BEGIN failed--compilation aborted at /root/.cpan/build/IO-Compress-Zlib-2.004-1N88d1/blib/lib/IO/Compress/RawDeflate.pm line 10.
Compilation failed in require at t/108anyunc-rawdeflate.t line 14.
BEGIN failed--compilation aborted at t/108anyunc-rawdeflate.t line 14.
t/108anyunc-rawdeflate..........dubious
        Test returned status 9 (wstat 2304, 0x900)
t/108anyunc-transparent.........ok
t/108anyunc-zip.................IO::Compress::Base::Common version 2.004 required--this is only version 2.001 at /root/.cpan/build/IO-Compress-Zlib-2.004-1N88d1/blib/lib/IO/Compress/Zip.pm line 7.
BEGIN failed--compilation aborted at /root/.cpan/build/IO-Compress-Zlib-2.004-1N88d1/blib/lib/IO/Compress/Zip.pm line 7.
Compilation failed in require at t/108anyunc-zip.t line 14.
BEGIN failed--compilation aborted at t/108anyunc-zip.t line 14.
t/108anyunc-zip.................dubious
        Test returned status 9 (wstat 2304, 0x900)
t/109merge-deflate..............IO::Compress::Base version 2.004 required--this is only version 2.001 at /root/.cpan/build/IO-Compress-Zlib-2.004-1N88d1/blib/lib/IO/Compress/RawDeflate.pm line 10.
BEGIN failed--compilation aborted at /root/.cpan/build/IO-Compress-Zlib-2.004-1N88d1/blib/lib/IO/Compress/RawDeflate.pm line 10.
Compilation failed in require at /root/.cpan/build/IO-Compress-Zlib-2.004-1N88d1/blib/lib/IO/Compress/Deflate.pm line 9.
BEGIN failed--compilation aborted at /root/.cpan/build/IO-Compress-Zlib-2.004-1N88d1/blib/lib/IO/Compress/Deflate.pm line 9.
Compilation failed in require at t/109merge-deflate.t line 12.
BEGIN failed--compilation aborted at t/109merge-deflate.t line 12.
t/109merge-deflate..............dubious
        Test returned status 9 (wstat 2304, 0x900)
t/109merge-gzip.................IO::Compress::Base version 2.004 required--this is only version 2.001 at /root/.cpan/build/IO-Compress-Zlib-2.004-1N88d1/blib/lib/IO/Compress/RawDeflate.pm line 10.
BEGIN failed--compilation aborted at /root/.cpan/build/IO-Compress-Zlib-2.004-1N88d1/blib/lib/IO/Compress/RawDeflate.pm line 10.
Compilation failed in require at /root/.cpan/build/IO-Compress-Zlib-2.004-1N88d1/blib/lib/IO/Compress/Gzip.pm line 11.
BEGIN failed--compilation aborted at /root/.cpan/build/IO-Compress-Zlib-2.004-1N88d1/blib/lib/IO/Compress/Gzip.pm line 11.
Compilation failed in require at t/109merge-gzip.t line 12.
BEGIN failed--compilation aborted at t/109merge-gzip.t line 12.
t/109merge-gzip.................dubious
        Test returned status 9 (wstat 2304, 0x900)
t/109merge-rawdeflate...........IO::Compress::Base version 2.004 required--this is only version 2.001 at /root/.cpan/build/IO-Compress-Zlib-2.004-1N88d1/blib/lib/IO/Compress/RawDeflate.pm line 10.
BEGIN failed--compilation aborted at /root/.cpan/build/IO-Compress-Zlib-2.004-1N88d1/blib/lib/IO/Compress/RawDeflate.pm line 10.
Compilation failed in require at t/109merge-rawdeflate.t line 12.
BEGIN failed--compilation aborted at t/109merge-rawdeflate.t line 12.
t/109merge-rawdeflate...........dubious
        Test returned status 9 (wstat 2304, 0x900)
t/109merge-zip..................skipped
        all skipped: not implemented yet
t/999pod........................ok
Failed Test                    Stat Wstat Total Fail  List of Failed
-------------------------------------------------------------------------------
t/000prereq.t                     3   768     6    3  1-3
t/001zlib-generic-deflate.t       9  2304    ??   ??  ??
t/001zlib-generic-gzip.t          9  2304    ??   ??  ??
t/001zlib-generic-rawdeflate.t    9  2304    ??   ??  ??
t/001zlib-generic-zip.t         255 65280    ??   ??  ??
t/002any-deflate.t              255 65280    ??   ??  ??
t/002any-gzip.t                 255 65280    ??   ??  ??
t/002any-rawdeflate.t           255 65280    ??   ??  ??
t/002any-transparent.t          255 65280    15   27  1 3-15
t/002any-zip.t                  255 65280    ??   ??  ??
t/004gziphdr.t                  255 65280   910 1813  3 5-910
t/005defhdr.t                   255 65280   595 1181  2 6-595
t/010examples.t                 255 65280    ??   ??  ??
t/050interop-gzip.t             255 65280     7   11  1 3-7
t/100generic-deflate.t            9  2304    ??   ??  ??
t/100generic-gzip.t               9  2304    ??   ??  ??
t/100generic-rawdeflate.t         9  2304    ??   ??  ??
t/100generic-zip.t              255 65280    ??   ??  ??
t/101truncate-deflate.t         255 65280   734 1468  1-734
t/101truncate-gzip.t            255 65280   978 1956  1-978
t/101truncate-rawdeflate.t      255 65280   625 1250  1-625
t/101truncate-zip.t             255 65280  2316 4632  1-2316
t/102tied-deflate.t               9  2304    ??   ??  ??
t/102tied-gzip.t                  9  2304    ??   ??  ??
t/102tied-rawdeflate.t            9  2304    ??   ??  ??
t/102tied-zip.t                 255 65280    ??   ??  ??
t/103newtied-deflate.t            9  2304    ??   ??  ??
t/103newtied-gzip.t               9  2304    ??   ??  ??
t/103newtied-rawdeflate.t         9  2304    ??   ??  ??
t/103newtied-zip.t              255 65280    ??   ??  ??
t/104destroy-deflate.t            9  2304    ??   ??  ??
t/104destroy-gzip.t               9  2304    ??   ??  ??
t/104destroy-rawdeflate.t         9  2304    ??   ??  ??
t/104destroy-zip.t              255 65280    ??   ??  ??
t/105oneshot-deflate.t            9  2304    ??   ??  ??
t/105oneshot-gzip-only.t        255 65280    70  137  1 3-70
t/105oneshot-gzip.t               9  2304    ??   ??  ??
t/105oneshot-rawdeflate.t         9  2304    ??   ??  ??
t/105oneshot-zip-only.t         255 65280   146  289  1 3-146
t/105oneshot-zip.t              255 65280    ??   ??  ??
t/106prime-deflate.t              9  2304    ??   ??  ??
t/106prime-gzip.t                 9  2304    ??   ??  ??
t/106prime-rawdeflate.t           9  2304    ??   ??  ??
t/106prime-zip.t                255 65280    ??   ??  ??
t/107multi-deflate.t              9  2304    ??   ??  ??
t/107multi-gzip.t                 9  2304    ??   ??  ??
t/107multi-rawdeflate.t           9  2304    ??   ??  ??
t/107multi-zip.t                255 65280    ??   ??  ??
t/108anyunc-deflate.t             9  2304    ??   ??  ??
t/108anyunc-gzip.t                9  2304    ??   ??  ??
t/108anyunc-rawdeflate.t          9  2304    ??   ??  ??
t/108anyunc-zip.t                 9  2304    ??   ??  ??
t/109merge-deflate.t              9  2304    ??   ??  ??
t/109merge-gzip.t                 9  2304    ??   ??  ??
t/109merge-rawdeflate.t           9  2304    ??   ??  ??
3 tests skipped.
Failed 55/60 test scripts. 6388/6434 subtests failed.
Files=60, Tests=6434,  9 wallclock secs ( 5.52 cusr +  0.81 csys =  6.33 CPU)
Failed 55/60 test programs. 6388/6434 subtests failed.
make: *** [test_dynamic] Error 255
  PMQS/IO-Compress-Zlib-2.004.tar.gz
  /usr/bin/make test -- NOT OK
Running make install
  make test had returned bad status, won't install without force
Running install for module 'IO::Uncompress::Base'
Running make install
  make test had returned bad status, won't install without force
Running install for module 'IO::Compress::Base'
Running make install
  make test had returned bad status, won't install without force
Running install for module 'IO::Uncompress::Gunzip'
Running make install
  make test had returned bad status, won't install without force
Running install for module 'IO::Compress::Gzip'
Running make install
  make test had returned bad status, won't install without force
Running install for module 'Compress::Raw::Zlib'
Running make for P/PM/PMQS/Compress-Raw-Zlib-2.004.tar.gz
  Has already been unwrapped into directory /root/.cpan/build/Compress-Raw-Zlib-2.004-6hFX04
  Has already been made
Running make test
  Has already been tested successfully
Running make install
  Already done
Running install for module 'IO::Compress::Base::Common'
Running make install
  make test had returned bad status, won't install without force
Running make for P/PM/PMQS/Compress-Zlib-2.004.tar.gz
  Has already been unwrapped into directory /root/.cpan/build/Compress-Zlib-2.004-LzRep5

  CPAN.pm: Going to build P/PM/PMQS/Compress-Zlib-2.004.tar.gz

Warning: Prerequisite 'IO::Compress::Gzip::Constants => 2.004' for 'P/PM/PMQS/Compress-Zlib-2.004.tar.gz' failed when processing 'P/PM/PMQS/IO-Compress-Zlib-2.004.tar.gz' with 'make_test => NO'. Continuing, but chances to succeed are limited.
Warning: Prerequisite 'IO::Uncompress::Base => 2.004' for 'P/PM/PMQS/Compress-Zlib-2.004.tar.gz' failed when processing 'P/PM/PMQS/IO-Compress-Base-2.004.tar.gz' with 'make_test => NO'. Continuing, but chances to succeed are limited.
Warning: Prerequisite 'IO::Compress::Base => 2.004' for 'P/PM/PMQS/Compress-Zlib-2.004.tar.gz' failed when processing 'P/PM/PMQS/IO-Compress-Base-2.004.tar.gz' with 'make_test => NO'. Continuing, but chances to succeed are limited.
Warning: Prerequisite 'IO::Uncompress::Gunzip => 2.004' for 'P/PM/PMQS/Compress-Zlib-2.004.tar.gz' failed when processing 'P/PM/PMQS/IO-Compress-Zlib-2.004.tar.gz' with 'make_test => NO'. Continuing, but chances to succeed are limited.
Warning: Prerequisite 'IO::Compress::Gzip => 2.004' for 'P/PM/PMQS/Compress-Zlib-2.004.tar.gz' failed when processing 'P/PM/PMQS/IO-Compress-Zlib-2.004.tar.gz' with 'make_test => NO'. Continuing, but chances to succeed are limited.
Warning: Prerequisite 'Compress::Raw::Zlib => 2.004' for 'P/PM/PMQS/Compress-Zlib-2.004.tar.gz' already installed but installation looks suspicious. Skipping another installation attempt, to prevent looping endlessly.
Warning: Prerequisite 'IO::Compress::Base::Common => 2.004' for 'P/PM/PMQS/Compress-Zlib-2.004.tar.gz' failed when processing 'P/PM/PMQS/IO-Compress-Base-2.004.tar.gz' with 'make_test => NO'. Continuing, but chances to succeed are limited.
cp lib/Compress/Zlib.pm blib/lib/Compress/Zlib.pm
AutoSplitting blib/lib/Compress/Zlib.pm (blib/lib/auto/Compress/Zlib)
Manifying blib/man3/Compress::Zlib.3pm
  PMQS/Compress-Zlib-2.004.tar.gz
  /usr/bin/make PREFIX=~/perlmodules PREFIX=~/perlmodules -- OK
Running make test
PERL_DL_NONLAZY=1 /usr/bin/perl5.8.8 "-MExtUtils::Command::MM" "-e" "test_harness(0, 'blib/lib', 'blib/arch')" t/*.t
t/000prereq.....
#     Failed test (t/000prereq.t at line 46)
#     Tried to use 'Compress::Raw::Zlib'.
#     Error:  Compress::Raw::Zlib version 2.004 required--this is only version 2.001 at (eval 3) line 2.
# BEGIN failed--compilation aborted at t/000prereq.t line 46.

#     Failed test (t/000prereq.t at line 46)
#     Tried to use 'IO::Compress::Base'.
#     Error:  IO::Compress::Base version 2.004 required--this is only version 2.001 at (eval 5) line 2.
# BEGIN failed--compilation aborted at t/000prereq.t line 46.
t/000prereq.....NOK 2/6
#     Failed test (t/000prereq.t at line 46)
#     Tried to use 'IO::Compress::Gzip'.
#     Error:  IO::Compress::Gzip version 2.004 required--this is only version 2.001 at (eval 20) line 2.
# BEGIN failed--compilation aborted at t/000prereq.t line 46.

#     Failed test (t/000prereq.t at line 46)
#     Tried to use 'IO::Uncompress::Gunzip'.
#     Error:  IO::Uncompress::Gunzip version 2.004 required--this is only version 2.001 at (eval 21) line 2.
# BEGIN failed--compilation aborted at t/000prereq.t line 46.
Use of uninitialized value in concatenation (.) or string at /usr/lib/perl5/5.8.8/i686-linux/Scalar/Util.pm line 30.

#     Failed test (t/000prereq.t at line 69)
# You don't have the XS version of Scalar::Util
# Looks like you failed 5 tests of 6.
t/000prereq.....dubious
        Test returned status 5 (wstat 1280, 0x500)
DIED. FAILED tests 1-4, 6
        Failed 5/6 tests, 16.67% okay
t/01version.....Use of uninitialized value in concatenation (.) or string at /usr/lib/perl5/5.8.8/i686-linux/Scalar/Util.pm line 30.

#     Failed test (t/01version.t at line 23)
#     Tried to use 'Compress::Zlib'.
#     Error:   is only avaliable with the XS version at /root/.cpan/build/Compress-Zlib-2.004-LzRep5/blib/lib/Compress/Zlib.pm line 9
# BEGIN failed--compilation aborted at t/01version.t line 23.
# Compilation failed in require at (eval 3) line 2.
# BEGIN failed--compilation aborted at (eval 3) line 2.
Bareword "ZLIB_VERSION" not allowed while "strict subs" in use at t/01version.t line 28.
Bareword "Compress::Zlib::zlib_version" not allowed while "strict subs" in use at t/01version.t line 29.
Execution of t/01version.t aborted due to compilation errors.
# Looks like you planned 2 tests but only ran 1.
# Looks like your test died just after 1.
t/01version.....dubious
        Test returned status 255 (wstat 65280, 0xff00)
DIED. FAILED tests 1-2
        Failed 2/2 tests, 0.00% okay
t/03zlib-v1.....Use of uninitialized value in concatenation (.) or string at /usr/lib/perl5/5.8.8/i686-linux/Scalar/Util.pm line 30.
t/03zlib-v1.....NOK 1/394
#     Failed test (t/03zlib-v1.t at line 35)
#     Tried to use 'Compress::Zlib'.
#     Error:   is only avaliable with the XS version at /root/.cpan/build/Compress-Zlib-2.004-LzRep5/blib/lib/Compress/Zlib.pm line 9
# BEGIN failed--compilation aborted at t/03zlib-v1.t line 35.
# Compilation failed in require at (eval 33) line 2.
# BEGIN failed--compilation aborted at (eval 33) line 2.
t/03zlib-v1.....ok 2/394Global symbol "$gzerrno" requires explicit package name at t/03zlib-v1.t line 1043.
Bareword "Compress::Zlib::zlib_version" not allowed while "strict subs" in use at t/03zlib-v1.t line 50.
Bareword "ZLIB_VERSION" not allowed while "strict subs" in use at t/03zlib-v1.t line 50.
Bareword "Z_BEST_COMPRESSION" not allowed while "strict subs" in use at t/03zlib-v1.t line 126.
Bareword "Z_OK" not allowed while "strict subs" in use at t/03zlib-v1.t line 147.
Bareword "Z_OK" not allowed while "strict subs" in use at t/03zlib-v1.t line 153.
Bareword "Z_OK" not allowed while "strict subs" in use at t/03zlib-v1.t line 158.
Bareword "Z_OK" not allowed while "strict subs" in use at t/03zlib-v1.t line 160.
Bareword "Z_OK" not allowed while "strict subs" in use at t/03zlib-v1.t line 169.
Bareword "Z_STREAM_END" not allowed while "strict subs" in use at t/03zlib-v1.t line 177.
Bareword "Z_OK" not allowed while "strict subs" in use at t/03zlib-v1.t line 177.
Bareword "Z_STREAM_END" not allowed while "strict subs" in use at t/03zlib-v1.t line 181.
Bareword "Z_OK" not allowed while "strict subs" in use at t/03zlib-v1.t line 192.
Bareword "Z_OK" not allowed while "strict subs" in use at t/03zlib-v1.t line 204.
Bareword "Z_OK" not allowed while "strict subs" in use at t/03zlib-v1.t line 206.
Bareword "Z_OK" not allowed while "strict subs" in use at t/03zlib-v1.t line 218.
Bareword "Z_STREAM_END" not allowed while "strict subs" in use at t/03zlib-v1.t line 229.
Bareword "Z_OK" not allowed while "strict subs" in use at t/03zlib-v1.t line 229.
Bareword "Z_STREAM_END" not allowed while "strict subs" in use at t/03zlib-v1.t line 233.
Bareword "Z_OK" not allowed while "strict subs" in use at t/03zlib-v1.t line 248.
Bareword "Z_OK" not allowed while "strict subs" in use at t/03zlib-v1.t line 253.
Bareword "Z_STREAM_END" not allowed while "strict subs" in use at t/03zlib-v1.t line 262.
Bareword "Z_BEST_COMPRESSION" not allowed while "strict subs" in use at t/03zlib-v1.t line 269.
Bareword "Z_OK" not allowed while "strict subs" in use at t/03zlib-v1.t line 275.
Bareword "Z_OK" not allowed while "strict subs" in use at t/03zlib-v1.t line 277.
Bareword "Z_STREAM_END" not allowed while "strict subs" in use at t/03zlib-v1.t line 284.
Bareword "Z_BEST_COMPRESSION" not allowed while "strict subs" in use at t/03zlib-v1.t line 307.
Bareword "Z_OK" not allowed while "strict subs" in use at t/03zlib-v1.t line 310.
Bareword "Z_OK" not allowed while "strict subs" in use at t/03zlib-v1.t line 312.
Bareword "Z_OK" not allowed while "strict subs" in use at t/03zlib-v1.t line 321.
Bareword "Z_STREAM_END" not allowed while "strict subs" in use at t/03zlib-v1.t line 327.
Bareword "Z_OK" not allowed while "strict subs" in use at t/03zlib-v1.t line 554.
Bareword "Z_OK" not allowed while "strict subs" in use at t/03zlib-v1.t line 560.
Bareword "Z_OK" not allowed while "strict subs" in use at t/03zlib-v1.t line 565.
Bareword "Z_OK" not allowed while "strict subs" in use at t/03zlib-v1.t line 567.
Bareword "Z_OK" not allowed while "strict subs" in use at t/03zlib-v1.t line 578.
Bareword "Z_STREAM_END" not allowed while "strict subs" in use at t/03zlib-v1.t line 585.
Bareword "Z_OK" not allowed while "strict subs" in use at t/03zlib-v1.t line 585.
Bareword "Z_STREAM_END" not allowed while "strict subs" in use at t/03zlib-v1.t line 589.
Bareword "Z_OK" not allowed while "strict subs" in use at t/03zlib-v1.t line 605.
Bareword "Z_OK" not allowed while "strict subs" in use at t/03zlib-v1.t line 608.
Bareword "Z_FULL_FLUSH" not allowed while "strict subs" in use at t/03zlib-v1.t line 611.
Bareword "Z_OK" not allowed while "strict subs" in use at t/03zlib-v1.t line 611.
Bareword "Z_OK" not allowed while "strict subs" in use at t/03zlib-v1.t line 615.
Bareword "Z_OK" not allowed while "strict subs" in use at t/03zlib-v1.t line 618.
Bareword "Z_OK" not allowed while "strict subs" in use at t/03zlib-v1.t line 626.
Bareword "Z_OK" not allowed while "strict subs" in use at t/03zlib-v1.t line 629.
Bareword "Z_DATA_ERROR" not allowed while "strict subs" in use at t/03zlib-v1.t line 636.
Bareword "Z_OK" not allowed while "strict subs" in use at t/03zlib-v1.t line 640.
Bareword "Z_STREAM_END" not allowed while "strict subs" in use at t/03zlib-v1.t line 650.
Bareword "Z_OK" not allowed while "strict subs" in use at t/03zlib-v1.t line 650.
Bareword "Z_DATA_ERROR" not allowed while "strict subs" in use at t/03zlib-v1.t line 655.
Bareword "Z_STREAM_END" not allowed while "strict subs" in use at t/03zlib-v1.t line 655.
Bareword "Z_OK" not allowed while "strict subs" in use at t/03zlib-v1.t line 666.
Bareword "Z_OK" not allowed while "strict subs" in use at t/03zlib-v1.t line 669.
Bareword "Z_OK" not allowed while "strict subs" in use at t/03zlib-v1.t line 672.
Bareword "Z_DATA_ERROR" not allowed while "strict subs" in use at t/03zlib-v1.t line 676.
Bareword "Z_BEST_COMPRESSION" not allowed while "strict subs" in use at t/03zlib-v1.t line 687.
Bareword "Z_DEFAULT_STRATEGY" not allowed while "strict subs" in use at t/03zlib-v1.t line 687.
Bareword "Z_OK" not allowed while "strict subs" in use at t/03zlib-v1.t line 690.
Bareword "Z_BEST_COMPRESSION" not allowed while "strict subs" in use at t/03zlib-v1.t line 692.
Bareword "Z_DEFAULT_STRATEGY" not allowed while "strict subs" in use at t/03zlib-v1.t line 693.
Bareword "Z_OK" not allowed while "strict subs" in use at t/03zlib-v1.t line 696.
Bareword "Z_BEST_COMPRESSION" not allowed while "strict subs" in use at t/03zlib-v1.t line 710.
Bareword "Z_DEFAULT_STRATEGY" not allowed while "strict subs" in use at t/03zlib-v1.t line 711.
Bareword "Z_BEST_SPEED" not allowed while "strict subs" in use at t/03zlib-v1.t line 714.
Bareword "Z_HUFFMAN_ONLY" not allowed while "strict subs" in use at t/03zlib-v1.t line 714.
Bareword "Z_OK" not allowed while "strict subs" in use at t/03zlib-v1.t line 715.
Bareword "Z_BEST_SPEED" not allowed while "strict subs" in use at t/03zlib-v1.t line 717.
Bareword "Z_HUFFMAN_ONLY" not allowed while "strict subs" in use at t/03zlib-v1.t line 718.
Bareword "Z_OK" not allowed while "strict subs" in use at t/03zlib-v1.t line 721.
Bareword "Z_NO_COMPRESSION" not allowed while "strict subs" in use at t/03zlib-v1.t line 726.
Bareword "Z_OK" not allowed while "strict subs" in use at t/03zlib-v1.t line 727.
Bareword "Z_NO_COMPRESSION" not allowed while "strict subs" in use at t/03zlib-v1.t line 729.
Bareword "Z_HUFFMAN_ONLY" not allowed while "strict subs" in use at t/03zlib-v1.t line 730.
Bareword "Z_OK" not allowed while "strict subs" in use at t/03zlib-v1.t line 733.
Bareword "Z_FILTERED" not allowed while "strict subs" in use at t/03zlib-v1.t line 738.
Bareword "Z_OK" not allowed while "strict subs" in use at t/03zlib-v1.t line 739.
Bareword "Z_NO_COMPRESSION" not allowed while "strict subs" in use at t/03zlib-v1.t line 741.
Bareword "Z_FILTERED" not allowed while "strict subs" in use at t/03zlib-v1.t line 742.
Bareword "Z_OK" not allowed while "strict subs" in use at t/03zlib-v1.t line 745.
Bareword "Z_OK" not allowed while "strict subs" in use at t/03zlib-v1.t line 749.
Bareword "Z_OK" not allowed while "strict subs" in use at t/03zlib-v1.t line 757.
Bareword "Z_STREAM_END" not allowed while "strict subs" in use at t/03zlib-v1.t line 761.
Bareword "Z_OK" not allowed while "strict subs" in use at t/03zlib-v1.t line 817.
Bareword "Z_OK" not allowed while "strict subs" in use at t/03zlib-v1.t line 823.
Bareword "Z_STREAM_END" not allowed while "strict subs" in use at t/03zlib-v1.t line 834.
Execution of t/03zlib-v1.t aborted due to compilation errors.
# Looks like you planned 394 tests but only ran 3.
# Looks like your test died just after 3.
t/03zlib-v1.....dubious
        Test returned status 255 (wstat 65280, 0xff00)
DIED. FAILED tests 1, 4-394
        Failed 392/394 tests, 0.51% okay
t/05examples....Use of uninitialized value in concatenation (.) or string at /usr/lib/perl5/5.8.8/i686-linux/Scalar/Util.pm line 30.
 is only avaliable with the XS version at /root/.cpan/build/Compress-Zlib-2.004-LzRep5/blib/lib/Compress/Zlib.pm line 9
BEGIN failed--compilation aborted at /root/.cpan/build/Compress-Zlib-2.004-LzRep5/blib/lib/Compress/Zlib.pm line 9.
Compilation failed in require at t/05examples.t line 16.
BEGIN failed--compilation aborted at t/05examples.t line 16.
# Looks like your test died before it could output anything.
t/05examples....dubious
        Test returned status 255 (wstat 65280, 0xff00)
t/06gzsetp......Use of uninitialized value in concatenation (.) or string at /usr/lib/perl5/5.8.8/i686-linux/Scalar/Util.pm line 30.
 is only avaliable with the XS version at /root/.cpan/build/Compress-Zlib-2.004-LzRep5/blib/lib/Compress/Zlib.pm line 9
BEGIN failed--compilation aborted at /root/.cpan/build/Compress-Zlib-2.004-LzRep5/blib/lib/Compress/Zlib.pm line 9.
Compilation failed in require at t/06gzsetp.t line 16.
BEGIN failed--compilation aborted at t/06gzsetp.t line 16.
# Looks like your test died before it could output anything.
t/06gzsetp......dubious
        Test returned status 255 (wstat 65280, 0xff00)
t/08encoding....Use of uninitialized value in concatenation (.) or string at /usr/lib/perl5/5.8.8/i686-linux/Scalar/Util.pm line 30.
t/08encoding....NOK 1/16
#     Failed test (t/08encoding.t at line 33)
#     Tried to use 'Compress::Zlib'.
#     Error:   is only avaliable with the XS version at /root/.cpan/build/Compress-Zlib-2.004-LzRep5/blib/lib/Compress/Zlib.pm line 9
# BEGIN failed--compilation aborted at t/08encoding.t line 33.
# Compilation failed in require at (eval 33) line 2.
# BEGIN failed--compilation aborted at (eval 33) line 2.
Bareword "Compress::Zlib::zlib_version" not allowed while "strict subs" in use at t/08encoding.t line 40.
Bareword "ZLIB_VERSION" not allowed while "strict subs" in use at t/08encoding.t line 40.
Execution of t/08encoding.t aborted due to compilation errors.
# Looks like you planned 16 tests but only ran 1.
# Looks like your test died just after 1.
t/08encoding....dubious
        Test returned status 255 (wstat 65280, 0xff00)
DIED. FAILED tests 1-16
        Failed 16/16 tests, 0.00% okay
t/14gzopen......Use of uninitialized value in concatenation (.) or string at /usr/lib/perl5/5.8.8/i686-linux/Scalar/Util.pm line 30.
t/14gzopen......NOK 1/217
#     Failed test (t/14gzopen.t at line 25)
#     Tried to use 'Compress::Zlib'.
#     Error:   is only avaliable with the XS version at /root/.cpan/build/Compress-Zlib-2.004-LzRep5/blib/lib/Compress/Zlib.pm line 9
# BEGIN failed--compilation aborted at t/14gzopen.t line 25.
# Compilation failed in require at (eval 33) line 2.
# BEGIN failed--compilation aborted at (eval 33) line 2.
t/14gzopen......ok 2/217Global symbol "$gzerrno" requires explicit package name at t/14gzopen.t line 49.
Global symbol "$gzerrno" requires explicit package name at t/14gzopen.t line 53.
Global symbol "$gzerrno" requires explicit package name at t/14gzopen.t line 56.
Global symbol "$gzerrno" requires explicit package name at t/14gzopen.t line 59.
Global symbol "$gzerrno" requires explicit package name at t/14gzopen.t line 66.
Global symbol "$gzerrno" requires explicit package name at t/14gzopen.t line 94.
Global symbol "$gzerrno" requires explicit package name at t/14gzopen.t line 97.
Global symbol "$gzerrno" requires explicit package name at t/14gzopen.t line 100.
Global symbol "$gzerrno" requires explicit package name at t/14gzopen.t line 104.
Global symbol "$gzerrno" requires explicit package name at t/14gzopen.t line 111.
Global symbol "$gzerrno" requires explicit package name at t/14gzopen.t line 111.
Global symbol "$gzerrno" requires explicit package name at t/14gzopen.t line 117.
Global symbol "$gzerrno" requires explicit package name at t/14gzopen.t line 118.
Global symbol "$gzerrno" requires explicit package name at t/14gzopen.t line 480.
Global symbol "$gzerrno" requires explicit package name at t/14gzopen.t line 481.
Global symbol "$gzerrno" requires explicit package name at t/14gzopen.t line 499.
Global symbol "$gzerrno" requires explicit package name at t/14gzopen.t line 502.
Bareword "Compress::Zlib::zlib_version" not allowed while "strict subs" in use at t/14gzopen.t line 38.
Bareword "ZLIB_VERSION" not allowed while "strict subs" in use at t/14gzopen.t line 38.
Bareword "Z_FINISH" not allowed while "strict subs" in use at t/14gzopen.t line 98.
Bareword "Z_STREAM_END" not allowed while "strict subs" in use at t/14gzopen.t line 110.
Bareword "Z_STREAM_END" not allowed while "strict subs" in use at t/14gzopen.t line 111.
Bareword "Z_STREAM_ERROR" not allowed while "strict subs" in use at t/14gzopen.t line 446.
Bareword "Z_STREAM_ERROR" not allowed while "strict subs" in use at t/14gzopen.t line 461.
Execution of t/14gzopen.t aborted due to compilation errors.
# Looks like you planned 217 tests but only ran 2.
# Looks like your test died just after 2.
t/14gzopen......dubious
        Test returned status 255 (wstat 65280, 0xff00)
DIED. FAILED tests 1, 3-217
        Failed 216/217 tests, 0.46% okay
t/99pod.........ok
Failed Test    Stat Wstat Total Fail  List of Failed
-------------------------------------------------------------------------------
t/000prereq.t     5  1280     6    5  1-4 6
t/01version.t   255 65280     2    3  1-2
t/03zlib-v1.t   255 65280   394  783  1 4-394
t/05examples.t  255 65280    ??   ??  ??
t/06gzsetp.t    255 65280    ??   ??  ??
t/08encoding.t  255 65280    16   31  1-16
t/14gzopen.t    255 65280   217  431  1 3-217
Failed 7/8 test scripts. 631/636 subtests failed.
Files=8, Tests=636,  3 wallclock secs ( 1.29 cusr +  0.17 csys =  1.46 CPU)
Failed 7/8 test programs. 631/636 subtests failed.
make: *** [test_dynamic] Error 255
  PMQS/Compress-Zlib-2.004.tar.gz
  /usr/bin/make test -- NOT OK
Running make install
  make test had returned bad status, won't install without force