CompileC "build/DesktopManager.build/Deployment/Desktop Manager.build/Objects-normal/i386/mach_inject.o" /opt/local/var/db/dports/build/_opt_local_var_db_dports_sources_rsync.rsync.darwinports.org_dpupdate_dports_aqua_DesktopManager/work/DesktopManager/CodeInjection/mach_inject.c normal i386 c com.apple.compilers.gcc.4_0
cd /opt/local/var/db/dports/build/_opt_local_var_db_dports_sources_rsync.rsync.darwinports.org_dpupdate_dports_aqua_DesktopManager/work/DesktopManager
/usr/bin/gcc-4.0 -x c -arch i386 -pipe -Wno-trigraphs -fpascal-strings -fasm-blocks -Os -fmessage-length=0 -fvisibility=hidden -I/opt/local/var/db/dports/build/_opt_local_var_db_dports_sources_rsync.rsync.darwinports.org_dpupdate_dports_aqua_DesktopManager/work/DesktopManager/build/DesktopManager.build/Deployment/Desktop\ Manager.build/Desktop\ Manager.hmap -Wmost -Wno-four-char-constants -Wno-unknown-pragmas -mdynamic-no-pic -F/opt/local/var/db/dports/build/_opt_local_var_db_dports_sources_rsync.rsync.darwinports.org_dpupdate_dports_aqua_DesktopManager/work/DesktopManager/build/Deployment -I/opt/local/var/db/dports/build/_opt_local_var_db_dports_sources_rsync.rsync.darwinports.org_dpupdate_dports_aqua_DesktopManager/work/DesktopManager/build/Deployment/include -I/opt/local/var/db/dports/build/_opt_local_var_db_dports_sources_rsync.rsync.darwinports.org_dpupdate_dports_aqua_DesktopManager/work/DesktopManager/build/DesktopManager.build/Deployment/Desktop\ Manager.build/DerivedSources -include /Library/Caches/com.apple.Xcode.0/SharedPrecompiledHeaders/DesktopManagerTNG_Prefix-edsmrlnzhpcboxbpjcngubakqefe/DesktopManagerTNG_Prefix.pch -c /opt/local/var/db/dports/build/_opt_local_var_db_dports_sources_rsync.rsync.darwinports.org_dpupdate_dports_aqua_DesktopManager/work/DesktopManager/CodeInjection/mach_inject.c -o /opt/local/var/db/dports/build/_opt_local_var_db_dports_sources_rsync.rsync.darwinports.org_dpupdate_dports_aqua_DesktopManager/work/DesktopManager/build/DesktopManager.build/Deployment/Desktop\ Manager.build/Objects-normal/i386/mach_inject.o
/opt/local/var/db/dports/build/_opt_local_var_db_dports_sources_rsync.rsync.darwinports.org_dpupdate_dports_aqua_DesktopManager/work/DesktopManager/CodeInjection/mach_inject.c: In function 'mach_inject':
/opt/local/var/db/dports/build/_opt_local_var_db_dports_sources_rsync.rsync.darwinports.org_dpupdate_dports_aqua_DesktopManager/work/DesktopManager/CodeInjection/mach_inject.c:102: error: 'ppc_thread_state_t' undeclared (first use in this function)
/opt/local/var/db/dports/build/_opt_local_var_db_dports_sources_rsync.rsync.darwinports.org_dpupdate_dports_aqua_DesktopManager/work/DesktopManager/CodeInjection/mach_inject.c:102: error: (Each undeclared identifier is reported only once
/opt/local/var/db/dports/build/_opt_local_var_db_dports_sources_rsync.rsync.darwinports.org_dpupdate_dports_aqua_DesktopManager/work/DesktopManager/CodeInjection/mach_inject.c:102: error: for each function it appears in.)
/opt/local/var/db/dports/build/_opt_local_var_db_dports_sources_rsync.rsync.darwinports.org_dpupdate_dports_aqua_DesktopManager/work/DesktopManager/CodeInjection/mach_inject.c:102: error: parse error before 'remoteThreadState'
/opt/local/var/db/dports/build/_opt_local_var_db_dports_sources_rsync.rsync.darwinports.org_dpupdate_dports_aqua_DesktopManager/work/DesktopManager/CodeInjection/mach_inject.c:107: error: 'remoteThreadState' undeclared (first use in this function)
/opt/local/var/db/dports/build/_opt_local_var_db_dports_sources_rsync.rsync.darwinports.org_dpupdate_dports_aqua_DesktopManager/work/DesktopManager/CodeInjection/mach_inject.c:135: error: 'PPC_THREAD_STATE' undeclared (first use in this function)
/opt/local/var/db/dports/build/_opt_local_var_db_dports_sources_rsync.rsync.darwinports.org_dpupdate_dports_aqua_DesktopManager/work/DesktopManager/CodeInjection/mach_inject.c:136: error: 'PPC_THREAD_STATE_COUNT' undeclared (first use in this function)
** BUILD FAILED **
Warning: the following items did not execute (for DesktopManager): com.apple.activate com.apple.build com.apple.destroot com.apple.install
Error: Status 1 encountered during processing.