rendered paste bodymips-linux-uclibc-gcc -o ssmtp ssmtp.o arpadate.o base64.o -lnsl -lssl
/home/xtc/Kamikaze/staging_dir_mips/lib/gcc/mips-linux-uclibc/4.1.2/../../../../mips-linux-uclibc/bin/ld: cannot find -lssl
collect2: ld returned 1 exit status
make[4]: *** [ssmtp] Error 1
make[4]: Leaving directory `/home/xtc/Kamikaze/build_mips/ssmtp-2.61'
make[3]: *** [/home/xtc/Kamikaze/build_mips/ssmtp-2.61/.built] Error 2
make[3]: Leaving directory `/home/xtc/packages/net/ssmtp'
make[2]: *** [ssmtp-compile] Error 2
make[2]: Leaving directory `/home/xtc/Kamikaze/package'
make[1]: *** [package/compile] Error 2
make[1]: Leaving directory `/home/xtc/Kamikaze'
make: *** [world] Fehler 2
Entering directory `/home/xtc/Kamikaze/build_mips/squid-2.6.STABLE12/src'
mips-linux-uclibc-gcc -Os -pipe -mips32 -mtune=mips32 -funit-at-a-time -I/home/xtc/Kamikaze/staging_dir_mips/usr/include -I/home/xtc/Kamikaze/staging_dir_mips/include -D_REENTRANT -o cf_gen cf_gen.o debug.o globals.o -L../lib -lmiscutil -lpthread -ldl -lm -lnsl
rm -f cf_gen
gcc -c ctype.c
gcc -o cf_gen cf_gen.c -DNODEBUG=1 -I./ -I../ -I../include/ -L../lib -lmiscutili686 -lm -lnsl -Wl,ctype.o
In file included from squid.h:393,
from cf_gen.c:51:
../include/md5.h:12:25: error: openssl/md5.h: No such file or directory
In file included from squid.h:396,
from cf_gen.c:51:
ssl_support.h:40:25: error: openssl/ssl.h: No such file or directory
ssl_support.h:43:25: error: openssl/err.h: No such file or directory
ssl_support.h:46:28: error: openssl/engine.h: No such file or directory
In file included from squid.h:396,
from cf_gen.c:51:
ssl_support.h:49: error: expected '=', ',', ';', 'asm' or '__attribute__' before '*' token
ssl_support.h:50: error: expected '=', ',', ';', 'asm' or '__attribute__' before '*' token
ssl_support.h:54: error: expected declaration specifiers or '...' before 'SSL'
ssl_support.h:56: error: expected ')' before '*' token
ssl_support.h:57: error: expected ')' before '*' token
ssl_support.h:58: error: expected ')' before '*' token
ssl_support.h:59: error: expected ')' before '*' token
ssl_support.h:60: error: expected ')' before '*' token
In file included from squid.h:421,
from cf_gen.c:51:
structs.h:391: error: expected specifier-qualifier-list before 'SSL_CTX'
structs.h:808: error: expected specifier-qualifier-list before 'SSL_CTX'
structs.h:917: error: expected specifier-qualifier-list before 'SSL'
structs.h:1510: error: expected specifier-qualifier-list before 'SSL_CTX'
structs.h:2142: error: 'MD5_DIGEST_LENGTH' undeclared here (not in a function)
make[5]: *** [cf_parser.h] Error 1
make[5]: Leaving directory `/home/xtc/Kamikaze/build_mips/squid-2.6.STABLE12/src'
make[4]: *** [all-recursive] Error 1
make[4]: Leaving directory `/home/xtc/Kamikaze/build_mips/squid-2.6.STABLE12'
make[3]: *** [/home/xtc/Kamikaze/build_mips/squid-2.6.STABLE12/.built] Error 2
make[3]: Leaving directory `/home/xtc/packages/net/squid'
make[2]: *** [squid-compile] Error 2
make[2]: Leaving directory `/home/xtc/Kamikaze/package'
make[1]: *** [package/compile] Error 2
make[1]: Leaving directory `/home/xtc/Kamikaze'
make: *** [world] Fehler 2