Stuff
public text v1 · immutableRCW_analysis.cxx:27: error: expected unqualified-id before '{' token
RCW_analysis.cxx:34: error: ISO C++ forbids declaration of 'ProcessingConfig' with no type
RCW_analysis.cxx:34: error: expected ';' before '&' token
RCW_analysis.cxx:40: error: expected `;' before 'bool'
scons: *** [RCW_analysis.o] Error 1
scons: building terminated because of errors.