All pastes #430630 Raw Edit

Something

public text v1 · immutable
·published 2007-04-09 03:41 UTC
rendered paste body
g++ -DCLAM_FLOAT -DUSE_PTHREADS=1 -DUSE_XERCES_TRUE -DCLAM_USE_XML -DUSE_LADSPA=1 -DUSE_FFTW=1 -DUSE_SNDFILE=1 -DUSE_OGGVORBIS=1 -DUSE_MAD=1 -DUSE_ID3=1 -DUSE_ALSA=1 -DUSE_JACK=1 -DUSE_PORTAUDIO=1 -DWITH_MAD=1 -DWITH_VORBIS=1 -DUSE_GL=1 -DUSE_QT=1 -I/usr/lib/qt-3.3/include -I/usr/local/include -I/usr/local/include/CLAM -I//usr/local/include -I/usr/lib/qt-3.3/include -I/usr/local/include -I. -I/usr/lib/qt-3.3/include/qt3 -IQtPlots/utils -c -o RCW_analysis.o RCW_analysis.cxx
RCW_analysis.cxx:16: error: 'SpectralPeakDetect' was not declared in this scope
RCW_analysis.cxx:16: error: template argument 1 is invalid
RCW_analysis.cxx:17: error: 'MyOutputData' was not declared in this scope
RCW_analysis.cxx:17: error: template argument 1 is invalid
RCW_analysis.cxx:18: error: 'NullProcessingConfig' does not name a type
RCW_analysis.cxx:21: error: expected ',' or '...' before '&' token
RCW_analysis.cxx:21: error: ISO C++ forbids declaration of 'Config' with no type
RCW_analysis.cxx:35: error: ISO C++ forbids declaration of 'ProcessingConfig' with no type
RCW_analysis.cxx:35: error: expected ';' before '&' token
RCW_analysis.cxx:41: error: expected `;' before 'bool'
RCW_analysis.cxx:50: error: expected ',' or '...' before '&' token
RCW_analysis.cxx:50: error: ISO C++ forbids declaration of 'SpectralPeakDetect' with no type
RCW_analysis.cxx: In constructor 'MyProcessing::MyProcessing(int)':
RCW_analysis.cxx:23: error: member initializer expression list treated as compound expression
RCW_analysis.cxx:23: error: invalid conversion from 'MyProcessing* const' to 'int'
RCW_analysis.cxx:23: error: member initializer expression list treated as compound expression
RCW_analysis.cxx:23: error: invalid conversion from 'MyProcessing* const' to 'int'
RCW_analysis.cxx:25: error: 'config' was not declared in this scope
RCW_analysis.cxx: In member function 'virtual bool MyProcessing::Do()':
RCW_analysis.cxx:43: error: request for member 'GetData' in '((MyProcessing*)this)->MyProcessing::mIn', which is of non-class type 'int'
RCW_analysis.cxx:43: error: request for member 'GetData' in '((MyProcessing*)this)->MyProcessing::mOut', which is of non-class type 'int'
RCW_analysis.cxx:45: error: request for member 'Consume' in '((MyProcessing*)this)->MyProcessing::mIn', which is of non-class type 'int'
RCW_analysis.cxx:46: error: request for member 'Produce' in '((MyProcessing*)this)->MyProcessing::mOut', which is of non-class type 'int'
scons: *** [RCW_analysis.o] Error 1
scons: building terminated because of errors.