% emerge -av pax-utils
These are the packages that would be merged, in order:
Calculating dependencies... done!
[ebuild N ] app-misc/pax-utils-0.1.15 USE="(-caps)" 0 kB
Total: 1 package (1 new), Size of downloads: 0 kB
Would you like to merge these packages? [Yes/No] y
>>> Verifying ebuild Manifests...
>>> Emerging (1 of 1) app-misc/pax-utils-0.1.15 to /
* pax-utils-0.1.15.tar.bz2 MD5 ;-) ... [ ok ]
* pax-utils-0.1.15.tar.bz2 RMD160 ;-) ... [ ok ]
* pax-utils-0.1.15.tar.bz2 SHA1 ;-) ... [ ok ]
* pax-utils-0.1.15.tar.bz2 SHA256 ;-) ... [ ok ]
* pax-utils-0.1.15.tar.bz2 size ;-) ... [ ok ]
* checking ebuild checksums ;-) ... [ ok ]
* checking auxfile checksums ;-) ... [ ok ]
* checking miscfile checksums ;-) ... [ ok ]
* checking pax-utils-0.1.15.tar.bz2 ;-) ... [ ok ]
>>> Unpacking source...
>>> Unpacking pax-utils-0.1.15.tar.bz2 to /export/scratch0/GentooPrefix/var/tmp/portage/app-misc/pax-utils-0.1.15/work
>>> Source unpacked.
>>> Compiling source in /export/scratch0/GentooPrefix/var/tmp/portage/app-misc/pax-utils-0.1.15/work/pax-utils-0.1.15 ...
i386-pc-solaris2.10-gcc -O2 -pipe -D_GNU_SOURCE -DVERSION="0.1.15" -o scanelf.o -c scanelf.c
i386-pc-solaris2.10-gcc -O2 -pipe -D_GNU_SOURCE -DVERSION="0.1.15" -o pspax.o -c pspax.c
i386-pc-solaris2.10-gcc -O2 -pipe -D_GNU_SOURCE -DVERSION="0.1.15" -o dumpelf.o -c dumpelf.c
In file included from paxinc.h:15,
from scanelf.c:10:
porting.h:123:4: error: #error "no idea what the native byte order is"
scanelf.c:66: error: 'gmatch' redeclared as different kind of symbol
/usr/include/libgen.h:127: error: previous declaration of 'gmatch' was here
In file included from paxinc.h:15,
from dumpelf.c:10:
porting.h:123:4: error: #error "no idea what the native byte order is"
dumpelf.c:273: warning: initialization discards qualifiers from pointer target type
dumpelf.c:274: warning: initialization discards qualifiers from pointer target type
dumpelf.c:275: warning: initialization discards qualifiers from pointer target type
scanelf.c: In function 'rpath_security_checks':
scanelf.c:439: warning: format '%o' expects type 'unsigned int', but argument 12 has type 'long unsigned int'
scanelf.c: In function 'scanelf_file_rpath':
scanelf.c:566: warning: overflow in implicit constant conversion
scanelf.c:703:2: warning: #warning Cache support not implemented for your target
make: *** [dumpelf.o] Error 1
make: *** Waiting for unfinished jobs....
scanelf.c:1438:2: warning: #warning Cache config support not implemented for your target
scanelf.c: At top level:
scanelf.c:1492: warning: initialization discards qualifiers from pointer target type
scanelf.c:1493: warning: initialization discards qualifiers from pointer target type
scanelf.c:1494: warning: initialization discards qualifiers from pointer target type
scanelf.c:1495: warning: initialization discards qualifiers from pointer target type
scanelf.c:1496: warning: initialization discards qualifiers from pointer target type
scanelf.c:1497: warning: initialization discards qualifiers from pointer target type
scanelf.c:1498: warning: initialization discards qualifiers from pointer target type
scanelf.c:1499: warning: initialization discards qualifiers from pointer target type
scanelf.c:1500: warning: initialization discards qualifiers from pointer target type
scanelf.c:1501: warning: initialization discards qualifiers from pointer target type
scanelf.c:1502: warning: initialization discards qualifiers from pointer target type
scanelf.c:1503: warning: initialization discards qualifiers from pointer target type
scanelf.c:1504: warning: initialization discards qualifiers from pointer target type
scanelf.c:1505: warning: initialization discards qualifiers from pointer target type
scanelf.c:1506: warning: initialization discards qualifiers from pointer target type
scanelf.c:1507: warning: initialization discards qualifiers from pointer target type
scanelf.c:1508: warning: initialization discards qualifiers from pointer target type
scanelf.c:1509: warning: initialization discards qualifiers from pointer target type
scanelf.c:1510: warning: initialization discards qualifiers from pointer target type
scanelf.c:1511: warning: initialization discards qualifiers from pointer target type
scanelf.c:1512: warning: initialization discards qualifiers from pointer target type
scanelf.c:1513: warning: initialization discards qualifiers from pointer target type
scanelf.c:1514: warning: initialization discards qualifiers from pointer target type
scanelf.c:1515: warning: initialization discards qualifiers from pointer target type
scanelf.c:1516: warning: initialization discards qualifiers from pointer target type
scanelf.c:1517: warning: initialization discards qualifiers from pointer target type
scanelf.c:1518: warning: initialization discards qualifiers from pointer target type
scanelf.c:1519: warning: initialization discards qualifiers from pointer target type
scanelf.c:1520: warning: initialization discards qualifiers from pointer target type
scanelf.c:1521: warning: initialization discards qualifiers from pointer target type
scanelf.c:1522: warning: initialization discards qualifiers from pointer target type
scanelf.c:1523: warning: initialization discards qualifiers from pointer target type
scanelf.c:1524: warning: initialization discards qualifiers from pointer target type
scanelf.c: In function 'parseargs':
scanelf.c:1795: error: '__PAX_UTILS_DEFAULT_LD_CACHE_CONFIG' undeclared (first use in this function)
scanelf.c:1795: error: (Each undeclared identifier is reported only once
scanelf.c:1795: error: for each function it appears in.)
In file included from paxinc.h:15,
from pspax.c:15:
porting.h:123:4: error: #error "no idea what the native byte order is"
pspax.c: In function 'get_proc_name':
pspax.c:50: warning: format '%u' expects type 'unsigned int', but argument 4 has type 'pid_t'
pspax.c: In function 'get_proc_maps':
pspax.c:70: warning: format '%u' expects type 'unsigned int', but argument 4 has type 'pid_t'
pspax.c: In function 'print_executable_mappings':
pspax.c:107: warning: format '%u' expects type 'unsigned int', but argument 4 has type 'pid_t'
pspax.c: In function 'get_proc_passwd':
pspax.c:152: warning: format '%u' expects type 'unsigned int', but argument 4 has type 'pid_t'
pspax.c: In function 'get_proc_status':
pspax.c:166: warning: format '%u' expects type 'unsigned int', but argument 4 has type 'pid_t'
pspax.c: In function 'get_pid_attr':
pspax.c:193: warning: format '%u' expects type 'unsigned int', but argument 4 has type 'pid_t'
pspax.c: In function 'get_proc_type':
pspax.c:209: warning: format '%u' expects type 'unsigned int', but argument 4 has type 'pid_t'
pspax.c: In function 'get_proc_phdr':
pspax.c:260: warning: format '%u' expects type 'unsigned int', but argument 4 has type 'pid_t'
pspax.c: In function 'pspax':
pspax.c:351: warning: format '%-6d' expects type 'int', but argument 3 has type 'pid_t'
pspax.c: At top level:
pspax.c:371: warning: initialization discards qualifiers from pointer target type
pspax.c:372: warning: initialization discards qualifiers from pointer target type
pspax.c:373: warning: initialization discards qualifiers from pointer target type
pspax.c:374: warning: initialization discards qualifiers from pointer target type
pspax.c:375: warning: initialization discards qualifiers from pointer target type
pspax.c:376: warning: initialization discards qualifiers from pointer target type
pspax.c:377: warning: initialization discards qualifiers from pointer target type
pspax.c:378: warning: initialization discards qualifiers from pointer target type
pspax.c:379: warning: initialization discards qualifiers from pointer target type
pspax.c:380: warning: initialization discards qualifiers from pointer target type
pspax.c:381: warning: initialization discards qualifiers from pointer target type
make: *** [scanelf.o] Error 1
make: *** [pspax.o] Error 1
!!! ERROR: app-misc/pax-utils-0.1.15 failed.
Call stack:
ebuild.sh, line 1694: Called dyn_compile
ebuild.sh, line 1051: Called qa_call 'src_compile'
ebuild.sh, line 44: Called src_compile
pax-utils-0.1.15.ebuild, line 23: Called die
!!! (no error message)
!!! If you need support, post the topmost build error, and the call stack if relevant.
!!! A complete build log is located at '/export/scratch0/GentooPrefix/var/tmp/portage/app-misc/pax-utils-0.1.15/temp/build.log'.