All pastes #429620 Raw Edit

Miscellany

public text v1 · immutable
·published 2007-04-08 10:18 UTC
rendered paste body
../../../WebCore/platform/qt/TemporaryLinkStubs.cpp:73: error: expected ‘,’ or ‘...’ before ‘&’ token
../../../WebCore/platform/qt/TemporaryLinkStubs.cpp:73: error: ISO C++ forbids declaration of ‘CurrentEventTag’ with no type
../../../WebCore/platform/qt/TemporaryLinkStubs.cpp:73: error: prototype for ‘WebCore::PlatformMouseEvent::PlatformMouseEvent(int)’ does not match any in class ‘WebCore::PlatformMouseEvent’
../../../WebCore/platform/PlatformMouseEvent.h:65: error: candidates are: WebCore::PlatformMouseEvent::PlatformMouseEvent(const WebCore::PlatformMouseEvent&)
../../../WebCore/platform/PlatformMouseEvent.h:121: error:                 WebCore::PlatformMouseEvent::PlatformMouseEvent(QMouseEvent*, int)
../../../WebCore/platform/PlatformMouseEvent.h:80: error:                 WebCore::PlatformMouseEvent::PlatformMouseEvent(const WebCore::IntPoint&, const WebCore::IntPoint&, WebCore::MouseButton, WebCore::MouseEventType, int, bool, bool, bool, bool, double)
../../../WebCore/platform/PlatformMouseEvent.h:67: error:                 WebCore::PlatformMouseEvent::PlatformMouseEvent()
make[1]: *** [tmp/TemporaryLinkStubs.o] Error 1
make[1]: Leaving directory `/home/aquarius/code/webkit/WebKit/WebKitBuild/Release/WebCore'
make: *** [sub-WebCore-make_default-ordered] Error 2