All pastes #42613 Raw Edit

Anonymous

public text v1 · immutable
#42613 ·published 2006-02-21 08:21 UTC
rendered paste body
camel.c:35:17: error: ssl.h: No such file or directory
camel.c: In function 'camel_shutdown':
camel.c:59: warning: implicit declaration of function 'NSS_Shutdown'
camel.c: In function 'camel_init':
camel.c:94: warning: implicit declaration of function 'NSS_InitReadWrite'
camel.c:94: error: 'SECFailure' undeclared (first use in this function)
camel.c:94: error: (Each undeclared identifier is reported only once
camel.c:94: error: for each function it appears in.)
camel.c:96: warning: implicit declaration of function 'NSS_NoDB_Init'
camel.c:102: warning: implicit declaration of function 'NSS_SetDomesticPolicy'
camel.c:104: warning: implicit declaration of function 'SSL_OptionSetDefault'
camel.c:104: error: 'SSL_ENABLE_SSL2' undeclared (first use in this function)
camel.c:105: error: 'SSL_ENABLE_SSL3' undeclared (first use in this function)
camel.c:106: error: 'SSL_ENABLE_TLS' undeclared (first use in this function)
camel.c:107: error: 'SSL_V2_COMPATIBLE_HELLO' undeclared (first use in this function)
make[3]: *** [camel.lo] Error 1
make[3]: Leaving directory `/home/deepak/cvs/gnome/evolution-data-server/camel'
make[2]: *** [all-recursive] Error 1
make[2]: Leaving directory `/home/deepak/cvs/gnome/evolution-data-server/camel'
make[1]: *** [all-recursive] Error 1
make[1]: Leaving directory `/home/deepak/cvs/gnome/evolution-data-server'
make: *** [all] Error 2
*** error during stage build of evolution-data-server: could not build module *** [2/3]


  [1] rerun stage build
  [2] ignore error and continue to install
  [3] give up on module
  [4] start shell
  [5] go to stage force_checkout
  [6] go to stage configure