All pastes #42526 Raw Edit

Something

public text v1 · immutable
#42526 ·published 2006-02-21 03:10 UTC
rendered paste body
/bin/sh ../libtool --silent --tag=CXX --mode=compile g++ -DHAVE_CONFIG_H -I. -I. -I.. -I../dcop -I../kdecore -I../kio/kssl -I../kjs -I.. -I../dcop -I../libltdl -I../kdefx -I../kdecore -I../kdecore -I../kdeui -I../kio -I../kio/kio -I../kio/kfile -I.. -I/opt/qt/include -I. -I/opt/kde/include  -D_REENTRANT    -DQT_THREAD_SUPPORT  -D_REENTRANT  -Wno-long-long -Wundef -ansi -D_XOPEN_SOURCE=500 -D_BSD_SOURCE -Wcast-align -Wconversion -Wchar-subscripts -Wall -W -Wpointer-arith -DNDEBUG -DNO_DEBUG -O2 -march=i686 -O2 -pipe -Wformat-security -Wmissing-format-attribute -Wno-non-virtual-dtor -fno-exceptions -fno-check-new -fno-common -fvisibility=hidden -fvisibility-inlines-hidden  -DQT_CLEAN_NAMESPACE -DQT_NO_ASCII_CAST -DQT_NO_STL -DQT_NO_COMPAT -DQT_NO_TRANSLATION  -c -o libkdnssd_la.all_cpp.lo libkdnssd_la.all_cpp.cpp
remoteservice.cpp:46: error: variable or field 'resolve_callback' declared void
remoteservice.cpp:46: error: 'AvahiServiceResolver' was not declared in this scope
remoteservice.cpp:46: error: expected primary-expression before ',' token
remoteservice.cpp:46: error: expected primary-expression before ',' token
remoteservice.cpp:46: error: expected primary-expression before 'proto'
remoteservice.cpp:46: error: expected primary-expression before 'e'
remoteservice.cpp:47: error: expected primary-expression before 'const'
remoteservice.cpp:47: error: expected primary-expression before 'const'
remoteservice.cpp:47: error: expected primary-expression before 'const'
remoteservice.cpp:47: error: expected primary-expression before 'const'
remoteservice.cpp:47: error: expected primary-expression before 'const'
remoteservice.cpp:48: error: expected primary-expression before 'port'
remoteservice.cpp:48: error: expected primary-expression before '*' token
remoteservice.cpp:48: error: 'txt' was not declared in this scope
remoteservice.cpp:48: error: expected primary-expression before 'void'
remoteservice.cpp:48: error: initializer expression list treated as compound expression
remoteservice.cpp:57: error: ISO C++ forbids declaration of 'AvahiServiceResolver' with no type
remoteservice.cpp:57: error: expected ';' before '*' token
remoteservice.cpp: In constructor 'DNSSD::RemoteServicePrivate::RemoteServicePrivate()':
remoteservice.cpp:54: error: class 'DNSSD::RemoteServicePrivate' does not have any field named 'm_resolver'
remoteservice.cpp: In member function 'void DNSSD::RemoteServicePrivate::stop()':
remoteservice.cpp:60: error: 'm_resolver' was not declared in this scope
remoteservice.cpp:60: error: 'avahi_service_resolver_free' was not declared in this scoperemoteservice.cpp:61: error: 'm_resolver' was not declared in this scope
remoteservice.cpp: In destructor 'virtual DNSSD::RemoteService::~RemoteService()':
remoteservice.cpp:92: error: 'class DNSSD::RemoteServicePrivate' has no member named 'm_resolver'
remoteservice.cpp:92: error: 'class DNSSD::RemoteServicePrivate' has no member named 'm_resolver'
remoteservice.cpp:92: error: 'avahi_service_resolver_free' was not declared in this scoperemoteservice.cpp: In member function 'void DNSSD::RemoteService::resolveAsync()':
remoteservice.cpp:114: error: 'class DNSSD::RemoteServicePrivate' has no member named 'm_resolver'
remoteservice.cpp:115: error: 'avahi_service_resolver_new' was not declared in this scoperemoteservice.cpp:117: error: 'class DNSSD::RemoteServicePrivate' has no member named 'm_resolver'
remoteservice.cpp: At global scope:
remoteservice.cpp:172: error: variable or field 'resolve_callback' declared void
remoteservice.cpp:172: error: redefinition of 'int DNSSD::resolve_callback'
remoteservice.cpp:46: error: 'int DNSSD::resolve_callback' previously defined here
remoteservice.cpp:172: error: 'AvahiServiceResolver' was not declared in this scope
remoteservice.cpp:172: error: expected primary-expression before ',' token
remoteservice.cpp:172: error: expected primary-expression before ',' token
remoteservice.cpp:172: error: expected primary-expression before ',' token
remoteservice.cpp:172: error: expected primary-expression before 'e'
remoteservice.cpp:173: error: expected primary-expression before 'const'
remoteservice.cpp:173: error: expected primary-expression before 'const'
remoteservice.cpp:173: error: expected primary-expression before 'const'
remoteservice.cpp:173: error: expected primary-expression before 'const'
remoteservice.cpp:173: error: expected primary-expression before 'const'
remoteservice.cpp:174: error: expected primary-expression before 'port'
remoteservice.cpp:174: error: expected primary-expression before '*' token
remoteservice.cpp:174: error: 'txt' was not declared in this scope
remoteservice.cpp:174: error: expected primary-expression before 'void'
responder.cpp: In constructor 'DNSSD::Responder::Responder()':
responder.cpp:50: error: cannot convert 'void (*)(AvahiClient*, AvahiClientState, void*)' to 'AvahiClientFlags' for argument '2' to 'AvahiClient* avahi_client_new(const AvahiPoll*, AvahiClientFlags, void (*)(AvahiClient*, AvahiClientState, void*), void*, int*)'
responder.cpp: In member function 'AvahiClientState DNSSD::Responder::state() const':
responder.cpp:76: error: 'AVAHI_CLIENT_DISCONNECTED' was not declared in this scope
publicservice.cpp: At global scope:
publicservice.cpp:48: error: variable or field 'publish_callback' declared void
publicservice.cpp:48: error: 'AvahiEntryGroup' was not declared in this scope
publicservice.cpp:48: error: expected primary-expression before ',' token
publicservice.cpp:48: error: expected primary-expression before 's'
publicservice.cpp:48: error: expected primary-expression before 'void'
publicservice.cpp:48: error: initializer expression list treated as compound expression
publicservice.cpp:58: error: ISO C++ forbids declaration of 'AvahiEntryGroup' with no type
publicservice.cpp:58: error: expected ';' before '*' token
publicservice.cpp: In member function 'void DNSSD::PublicServicePrivate::commit()':
publicservice.cpp:61: error: 'm_group' was not declared in this scope
publicservice.cpp:61: error: 'avahi_entry_group_commit' was not declared in this scope
publicservice.cpp: In constructor 'DNSSD::PublicService::PublicService(const QString&, const QString&, unsigned int, const QString&)':
publicservice.cpp:71: error: 'class DNSSD::PublicServicePrivate' has no member named 'm_group'
publicservice.cpp:72: error: 'avahi_entry_group_new' was not declared in this scope
publicservice.cpp: In destructor 'virtual DNSSD::PublicService::~PublicService()':
publicservice.cpp:82: error: 'class DNSSD::PublicServicePrivate' has no member named 'm_group'
publicservice.cpp:82: error: 'class DNSSD::PublicServicePrivate' has no member named 'm_group'
publicservice.cpp:82: error: 'avahi_entry_group_free' was not declared in this scope
publicservice.cpp: In member function 'void DNSSD::PublicService::setServiceName(const QString&)':
publicservice.cpp:99: error: 'class DNSSD::PublicServicePrivate' has no member named 'm_group'
publicservice.cpp:99: error: 'avahi_entry_group_reset' was not declared in this scope
publicservice.cpp: In member function 'void DNSSD::PublicService::setDomain(const QString&)':
publicservice.cpp:108: error: 'class DNSSD::PublicServicePrivate' has no member named 'm_group'
publicservice.cpp:108: error: 'avahi_entry_group_reset' was not declared in this scope
publicservice.cpp: In member function 'void DNSSD::PublicService::setType(const QString&)':
publicservice.cpp:118: error: 'class DNSSD::PublicServicePrivate' has no member named 'm_group'
publicservice.cpp:118: error: 'avahi_entry_group_reset' was not declared in this scope
publicservice.cpp: In member function 'void DNSSD::PublicService::setPort(short unsigned int)':
publicservice.cpp:127: error: 'class DNSSD::PublicServicePrivate' has no member named 'm_group'
publicservice.cpp:127: error: 'avahi_entry_group_reset' was not declared in this scope
publicservice.cpp: In member function 'void DNSSD::PublicService::setTextData(const QMap<QString, QString>&)':
publicservice.cpp:136: error: 'class DNSSD::PublicServicePrivate' has no member named 'm_group'
publicservice.cpp:136: error: 'avahi_entry_group_reset' was not declared in this scope
publicservice.cpp: In member function 'void DNSSD::PublicService::stop()':
publicservice.cpp:155: error: 'class DNSSD::PublicServicePrivate' has no member named 'm_group'
publicservice.cpp:155: error: 'class DNSSD::PublicServicePrivate' has no member named 'm_group'
publicservice.cpp:155: error: 'avahi_entry_group_reset' was not declared in this scope
publicservice.cpp: In member function 'bool DNSSD::PublicService::fillEntryGroup()':
publicservice.cpp:169: error: 'class DNSSD::PublicServicePrivate' has no member named 'm_group'
publicservice.cpp:171: error: 'avahi_entry_group_add_service_strlst' was not declared in this scope
publicservice.cpp: In member function 'void DNSSD::PublicService::clientState(AvahiClientState)':
publicservice.cpp:184: error: 'AVAHI_CLIENT_S_INVALID' was not declared in this scope
publicservice.cpp:185: error: 'AVAHI_CLIENT_DISCONNECTED' was not declared in this scope
publicservice.cpp:192: error: 'class DNSSD::PublicServicePrivate' has no member named 'm_group'
publicservice.cpp:192: error: 'avahi_entry_group_reset' was not declared in this scope
publicservice.cpp:180: warning: enumeration value 'AVAHI_CLIENT_FAILURE' not handled in switch
publicservice.cpp:180: warning: enumeration value 'AVAHI_CLIENT_CONNECTING' not handled in switch
publicservice.cpp: In member function 'void DNSSD::PublicService::publishAsync()':
publicservice.cpp:207: error: 'class DNSSD::PublicServicePrivate' has no member named 'm_group'
publicservice.cpp: At global scope:
publicservice.cpp:217: error: variable or field 'publish_callback' declared void
publicservice.cpp:217: error: redefinition of 'int DNSSD::publish_callback'
publicservice.cpp:48: error: 'int DNSSD::publish_callback' previously defined here
publicservice.cpp:217: error: 'AvahiEntryGroup' was not declared in this scope
publicservice.cpp:217: error: expected primary-expression before ',' token
publicservice.cpp:217: error: expected primary-expression before 's'
publicservice.cpp:217: error: expected primary-expression before 'void'
query.cpp:45: error: variable or field 'services_callback' declared void
query.cpp:45: error: 'AvahiServiceBrowser' was not declared in this scope
query.cpp:45: error: expected primary-expression before ',' token
query.cpp:45: error: expected primary-expression before ',' token
query.cpp:45: error: expected primary-expression before ',' token
query.cpp:45: error: expected primary-expression before 'event'
query.cpp:45: error: expected primary-expression before 'const'
query.cpp:46: error: expected primary-expression before 'const'
query.cpp:46: error: expected primary-expression before 'const'
query.cpp:46: error: expected primary-expression before 'void'
query.cpp:46: error: initializer expression list treated as compound expression
query.cpp:47: error: variable or field 'types_callback' declared void
query.cpp:47: error: 'AvahiServiceTypeBrowser' was not declared in this scope
query.cpp:47: error: expected primary-expression before ',' token
query.cpp:47: error: expected primary-expression before ',' token
query.cpp:47: error: expected primary-expression before ',' token
query.cpp:47: error: expected primary-expression before 'event'
query.cpp:47: error: expected primary-expression before 'const'
query.cpp:48: error: expected primary-expression before 'const'
query.cpp:48: error: expected primary-expression before 'void'
query.cpp:48: error: initializer expression list treated as compound expression
query.cpp:49: error: variable or field 'domains_callback' declared void
query.cpp:49: error: 'AvahiDomainBrowser' was not declared in this scope
query.cpp:49: error: expected primary-expression before ',' token
query.cpp:49: error: expected primary-expression before ',' token
query.cpp:49: error: expected primary-expression before ',' token
query.cpp:49: error: expected primary-expression before 'event'
query.cpp:49: error: expected primary-expression before 'const'
query.cpp:50: error: expected primary-expression before 'void'
query.cpp:50: error: initializer expression list treated as compound expression
query.cpp: In destructor 'virtual DNSSD::Query::~Query()':
query.cpp:81: error: 'AvahiServiceBrowser' was not declared in this scope
query.cpp:81: error: expected primary-expression before ')' token
query.cpp:81: error: 'avahi_service_browser_free' was not declared in this scope
query.cpp:82: error: 'AvahiServiceTypeBrowser' was not declared in this scope
query.cpp:82: error: expected primary-expression before ')' token
query.cpp:82: error: 'avahi_service_type_browser_free' was not declared in this scope
query.cpp: In member function 'virtual void DNSSD::Query::startQuery()':
query.cpp:114: error: 'avahi_service_type_browser_new' was not declared in this scope
query.cpp:123: error: 'avahi_service_browser_new' was not declared in this scope
query.cpp: At global scope:
query.cpp:159: error: variable or field 'services_callback' declared void
query.cpp:159: error: redefinition of 'int DNSSD::services_callback'
query.cpp:45: error: 'int DNSSD::services_callback' previously defined here
query.cpp:159: error: 'AvahiServiceBrowser' was not declared in this scope
query.cpp:159: error: expected primary-expression before ',' token
query.cpp:159: error: expected primary-expression before ',' token
query.cpp:159: error: expected primary-expression before ',' token
query.cpp:159: error: expected primary-expression before 'event'
query.cpp:160: error: expected primary-expression before 'const'
query.cpp:160: error: expected primary-expression before 'const'
query.cpp:160: error: expected primary-expression before 'const'
query.cpp:160: error: expected primary-expression before 'void'
query.cpp:174: error: variable or field 'types_callback' declared void
query.cpp:174: error: redefinition of 'int DNSSD::types_callback'
query.cpp:47: error: 'int DNSSD::types_callback' previously defined here
query.cpp:174: error: 'AvahiServiceTypeBrowser' was not declared in this scope
query.cpp:174: error: expected primary-expression before ',' token
query.cpp:174: error: expected primary-expression before ',' token
query.cpp:174: error: expected primary-expression before ',' token
query.cpp:174: error: expected primary-expression before 'event'
query.cpp:174: error: expected primary-expression before 'const'
query.cpp:175: error: expected primary-expression before 'const'
query.cpp:175: error: expected primary-expression before 'void'
domainbrowser.cpp:41: error: variable or field 'domains_callback' declared void
domainbrowser.cpp:41: error: redefinition of 'int DNSSD::domains_callback'
query.cpp:49: error: 'int DNSSD::domains_callback' previously defined here
domainbrowser.cpp:41: error: 'AvahiDomainBrowser' was not declared in this scope
domainbrowser.cpp:41: error: expected primary-expression before ',' token
domainbrowser.cpp:41: error: expected primary-expression before ',' token
domainbrowser.cpp:41: error: expected primary-expression before ',' token
domainbrowser.cpp:41: error: expected primary-expression before 'event'
domainbrowser.cpp:41: error: expected primary-expression before 'const'
domainbrowser.cpp:42: error: expected primary-expression before 'void'
domainbrowser.cpp:56: error: ISO C++ forbids declaration of 'AvahiDomainBrowser' with no type
domainbrowser.cpp:56: error: expected ';' before '*' token
domainbrowser.cpp: In constructor 'DNSSD::DomainBrowserPrivate::DomainBrowserPrivate(DNSSD::DomainBrowser*)':
domainbrowser.cpp:50: error: class 'DNSSD::DomainBrowserPrivate' does not have any field named 'm_browser'
domainbrowser.cpp: In destructor 'DNSSD::DomainBrowserPrivate::~DomainBrowserPrivate()':
domainbrowser.cpp:51: error: 'm_browser' was not declared in this scope
domainbrowser.cpp:51: error: 'avahi_domain_browser_free' was not declared in this scope
domainbrowser.cpp: In member function 'void DNSSD::DomainBrowser::startBrowse()':
domainbrowser.cpp:108: error: 'class DNSSD::DomainBrowserPrivate' has no member named 'm_browser'
domainbrowser.cpp:109: error: 'avahi_domain_browser_new' was not declared in this scope
domainbrowser.cpp: In member function 'void DNSSD::DomainBrowser::domainListChanged(int, int)':
domainbrowser.cpp:131: error: 'class DNSSD::DomainBrowserPrivate' has no member named 'm_browser'
domainbrowser.cpp:132: error: 'class DNSSD::DomainBrowserPrivate' has no member named 'm_browser'
domainbrowser.cpp:132: error: 'avahi_domain_browser_free' was not declared in this scope
domainbrowser.cpp:133: error: 'class DNSSD::DomainBrowserPrivate' has no member named 'm_browser'
domainbrowser.cpp: At global scope:
domainbrowser.cpp:170: error: variable or field 'domains_callback' declared void
domainbrowser.cpp:170: error: redefinition of 'int DNSSD::domains_callback'
query.cpp:49: error: 'int DNSSD::domains_callback' previously defined here
domainbrowser.cpp:170: error: 'AvahiDomainBrowser' was not declared in this scope
domainbrowser.cpp:170: error: expected primary-expression before ',' token
domainbrowser.cpp:170: error: expected primary-expression before ',' token
domainbrowser.cpp:170: error: expected primary-expression before ',' token
domainbrowser.cpp:170: error: expected primary-expression before 'event'
domainbrowser.cpp:170: error: expected primary-expression before 'const'
domainbrowser.cpp:171: error: expected primary-expression before 'void'
servicebrowser.cpp: In static member function 'static const DNSSD::ServiceBrowser::State DNSSD::ServiceBrowser::isAvailable()':
servicebrowser.cpp:89: error: 'AVAHI_CLIENT_S_INVALID' was not declared in this scope
servicebrowser.cpp:89: error: 'AVAHI_CLIENT_DISCONNECTED' was not declared in this scope
make[2]: *** [libkdnssd_la.all_cpp.lo] Error 1
make[2]: Leaving directory `/var/abs/extra/kde/kdelibs/src/kdelibs-3.5.1/kdnssd-avahi'
make[1]: *** [all-recursive] Error 1
make[1]: Leaving directory `/var/abs/extra/kde/kdelibs/src/kdelibs-3.5.1'
make: *** [all] Error 2