gcc -c -g -fkeep-inline-functions -DIN_GCC -W -Wall -Wwrite-strings -Wstrict
-prototypes -Wmissing-prototypes -Wold-style-definition -Wmissing-format-attribu
te -fno-common -DHAVE_CONFIG_H -I. -I. -I../../gcc -I../../gcc/. -I../../gcc/.
./include -I../../gcc/../libcpp/include -I../../gcc/../libdecnumber -I../libdec
number \
../../gcc/config/i386/i386.c -o i386.o
In file included from ../../gcc/config/i386/i386.c:54:
../../gcc/config/i386/i386elf.h:28:1: warning: "TARGET_VERSION" redefined
In file included from ./tm.h:11,
from ../../gcc/config/i386/i386.c:25:
../../gcc/config/i386/sysv4.h:24:1: warning: this is the location of the previou
s definition
In file included from ../../gcc/config/i386/i386.c:54:
../../gcc/config/i386/i386elf.h:46:1: warning: "ENDFILE_SPEC" redefined
In file included from ./tm.h:10,
from ../../gcc/config/i386/i386.c:25:
../../gcc/config/svr4.h:113:1: warning: this is the location of the previous def
inition
In file included from ../../gcc/config/i386/i386.c:54:
../../gcc/config/i386/i386elf.h:48:1: warning: "STARTFILE_SPEC" redefined
In file included from ./tm.h:10,
from ../../gcc/config/i386/i386.c:25:
../../gcc/config/svr4.h:172:1: warning: this is the location of the previous def
inition
../../gcc/config/i386/i386.c: In function 'override_options':
../../gcc/config/i386/i386.c:2137: warning: use of 'q' length modifier with 's'
type character
../../gcc/config/i386/i386.c: In function 'ix86_function_sseregparm':
../../gcc/config/i386/i386.c:3087: warning: unknown conversion type character 'D
' in format
../../gcc/config/i386/i386.c:3087: warning: too many arguments for format
../../gcc/config/i386/i386.c:3090: warning: unknown conversion type character 'T
' in format
../../gcc/config/i386/i386.c:3090: warning: too many arguments for format
../../gcc/config/i386/i386.c: In function 'output_set_got':
../../gcc/config/i386/i386.c:5452: warning: implicit declaration of function 'gg
c_strdup'
../../gcc/config/i386/i386.c:5452: warning: passing argument 3 of 'gen_rtx_fmt_s
00' makes pointer from integer without a cast
../../gcc/config/i386/i386.c: In function 'ix86_init_machine_status':
../../gcc/config/i386/i386.c:15153: warning: implicit declaration of function 'g
gc_alloc_cleared'
../../gcc/config/i386/i386.c:15153: warning: assignment makes pointer from integ
er without a cast
../../gcc/config/i386/i386.c: In function 'assign_386_stack_local':
../../gcc/config/i386/i386.c:15178: warning: implicit declaration of function 'g
gc_alloc'
../../gcc/config/i386/i386.c: In function 'get_element_number':
../../gcc/config/i386/i386.c:17779: warning: unknown conversion type character '
w' in format
../../gcc/config/i386/i386.c:17779: warning: too many arguments for format
In file included from ../../gcc/config/i386/i386.c:21748:
./gt-i386.h: At top level:
./gt-i386.h:25: warning: no previous prototype for 'gt_ggc_mx_stack_local_entry'
./gt-i386.h: In function 'gt_ggc_mx_stack_local_entry':
./gt-i386.h:27: warning: implicit declaration of function 'ggc_test_and_set_mark
'
./gt-i386.h:29: warning: implicit declaration of function 'gt_ggc_m_7rtx_def'
./gt-i386.h:30: warning: implicit declaration of function 'gt_ggc_m_17stack_loca
l_entry'
./gt-i386.h: At top level:
./gt-i386.h:36: warning: no previous prototype for 'gt_pch_nx_stack_local_entry'
./gt-i386.h: In function 'gt_pch_nx_stack_local_entry':
./gt-i386.h:38: warning: implicit declaration of function 'gt_pch_note_object'
./gt-i386.h:38: error: 'gt_pch_p_17stack_local_entry' undeclared (first use in t
his function)
./gt-i386.h:38: error: (Each undeclared identifier is reported only once
./gt-i386.h:38: error: for each function it appears in.)
./gt-i386.h:38: error: 'gt_ggc_e_17stack_local_entry' undeclared (first use in t
his function)
./gt-i386.h:40: warning: implicit declaration of function 'gt_pch_n_7rtx_def'
./gt-i386.h:41: warning: implicit declaration of function 'gt_pch_n_17stack_loca
l_entry'
./gt-i386.h: At top level:
./gt-i386.h:48: warning: type defaults to 'int' in declaration of 'gt_pointer_op
erator'
./gt-i386.h:48: error: expected ';', ',' or ')' before 'op'
./gt-i386.h:60: error: array type has incomplete element type
./gt-i386.h:65: error: 'gt_ggc_mx_tree_node' undeclared here (not in a function)
./gt-i386.h:66: error: 'gt_pch_nx_tree_node' undeclared here (not in a function)
./gt-i386.h:72: error: 'gt_ggc_mx_rtx_def' undeclared here (not in a function)
./gt-i386.h:73: error: 'gt_pch_nx_rtx_def' undeclared here (not in a function)
./gt-i386.h:82: error: 'LAST_GGC_ROOT_TAB' undeclared here (not in a function)
make[3]: *** [i386.o] Error 1
make[3]: Leaving directory `/home/FthrNtr/gcc-4.3/objects/gcc'
make[2]: *** [all-stage1-gcc] Error 2
make[2]: Leaving directory `/home/FthrNtr/gcc-4.3/objects'
make[1]: *** [stage1-bubble] Error 2
make[1]: Leaving directory `/home/FthrNtr/gcc-4.3/objects'
make: *** [all] Error 2
IriX64@FthrNtr /home/FthrNtr/gcc-4.3/objects
$