All pastes #41870 Raw Edit

Anonymous

public text v1 · immutable
#41870 ·published 2006-02-16 20:26 UTC
rendered paste body
This file contains any messages produced by compilers while
running configure, to aid debugging if configure makes a mistake.

It was created by ossie_demo configure 0.0.1, which was
generated by GNU Autoconf 2.59.  Invocation command line was

  $ ./configure 

## --------- ##
## Platform. ##
## --------- ##

hostname = ubuntu-jsimone
uname -m = i686
uname -r = 2.6.12-9-386
uname -s = Linux
uname -v = #1 Mon Oct 10 13:14:36 BST 2005

/usr/bin/uname -p = unknown
/bin/uname -X     = unknown

/bin/arch              = i686
/usr/bin/arch -k       = unknown
/usr/convex/getsysinfo = unknown
hostinfo               = unknown
/bin/machine           = unknown
/usr/bin/oslevel       = unknown
/bin/universe          = unknown

PATH: /usr/local/bin
PATH: /usr/local/sbin
PATH: /sbin
PATH: /usr/sbin
PATH: /bin
PATH: /usr/bin
PATH: /usr/bin/X11
PATH: /usr/games


## ----------- ##
## Core tests. ##
## ----------- ##

configure:1403: checking for a BSD-compatible install
configure:1458: result: /usr/bin/install -c
configure:1469: checking whether build environment is sane
configure:1512: result: yes
configure:1577: checking for gawk
configure:1593: found /usr/bin/gawk
configure:1603: result: gawk
configure:1613: checking whether make sets $(MAKE)
configure:1633: result: yes
configure:1856: checking for g++
configure:1872: found /usr/bin/g++
configure:1882: result: g++
configure:1898: checking for C++ compiler version
configure:1901: g++ --version </dev/null >&5
g++ (GCC) 4.0.2 20050808 (prerelease) (Ubuntu 4.0.1-4ubuntu9)
Copyright (C) 2005 Free Software Foundation, Inc.
This is free software; see the source for copying conditions.  There is NO
warranty; not even for MERCHANTABILITY or FITNESS FOR A PARTICULAR PURPOSE.

configure:1904: $? = 0
configure:1906: g++ -v </dev/null >&5
Using built-in specs.
Target: i486-linux-gnu
Configured with: ../src/configure -v --enable-languages=c,c++,java,f95,objc,ada,treelang --prefix=/usr --with-gxx-include-dir=/usr/include/c++/4.0.2 --enable-shared --with-system-zlib --libexecdir=/usr/lib --enable-nls --without-included-gettext --enable-threads=posix --program-suffix=-4.0 --enable-__cxa_atexit --enable-libstdcxx-allocator=mt --enable-clocale=gnu --enable-libstdcxx-debug --enable-java-gc=boehm --enable-java-awt=gtk --enable-gtk-cairo --with-java-home=/usr/lib/jvm/java-1.4.2-gcj-4.0-1.4.2.0/jre --enable-mpfr --disable-werror --enable-checking=release i486-linux-gnu
Thread model: posix
gcc version 4.0.2 20050808 (prerelease) (Ubuntu 4.0.1-4ubuntu9)
configure:1909: $? = 0
configure:1911: g++ -V </dev/null >&5
g++: '-V' option must have argument
configure:1914: $? = 1
configure:1937: checking for C++ compiler default output file name
configure:1940: g++    conftest.cc  >&5
configure:1943: $? = 0
configure:1989: result: a.out
configure:1994: checking whether the C++ compiler works
configure:2000: ./a.out
configure:2003: $? = 0
configure:2020: result: yes
configure:2027: checking whether we are cross compiling
configure:2029: result: no
configure:2032: checking for suffix of executables
configure:2034: g++ -o conftest    conftest.cc  >&5
configure:2037: $? = 0
configure:2062: result: 
configure:2068: checking for suffix of object files
configure:2089: g++ -c   conftest.cc >&5
configure:2092: $? = 0
configure:2114: result: o
configure:2118: checking whether we are using the GNU C++ compiler
configure:2142: g++ -c   conftest.cc >&5
configure:2148: $? = 0
configure:2151: test -z 			 || test ! -s conftest.err
configure:2154: $? = 0
configure:2157: test -s conftest.o
configure:2160: $? = 0
configure:2173: result: yes
configure:2179: checking whether g++ accepts -g
configure:2200: g++ -c -g  conftest.cc >&5
configure:2206: $? = 0
configure:2209: test -z 			 || test ! -s conftest.err
configure:2212: $? = 0
configure:2215: test -s conftest.o
configure:2218: $? = 0
configure:2229: result: yes
configure:2271: g++ -c -g -O2  conftest.cc >&5
configure:2277: $? = 0
configure:2280: test -z 			 || test ! -s conftest.err
configure:2283: $? = 0
configure:2286: test -s conftest.o
configure:2289: $? = 0
configure:2315: g++ -c -g -O2  conftest.cc >&5
conftest.cc: In function 'int main()':
conftest.cc:15: error: 'exit' was not declared in this scope
configure:2321: $? = 1
configure: failed program was:
| /* confdefs.h.  */
| 
| #define PACKAGE_NAME "ossie_demo"
| #define PACKAGE_TARNAME "ossie_demo"
| #define PACKAGE_VERSION "0.0.1"
| #define PACKAGE_STRING "ossie_demo 0.0.1"
| #define PACKAGE_BUGREPORT ""
| #define PACKAGE "ossie_demo"
| #define VERSION "0.0.1"
| /* end confdefs.h.  */
| 
| int
| main ()
| {
| exit (42);
|   ;
|   return 0;
| }
configure:2271: g++ -c -g -O2  conftest.cc >&5
configure:2277: $? = 0
configure:2280: test -z 			 || test ! -s conftest.err
configure:2283: $? = 0
configure:2286: test -s conftest.o
configure:2289: $? = 0
configure:2315: g++ -c -g -O2  conftest.cc >&5
configure:2321: $? = 0
configure:2324: test -z 			 || test ! -s conftest.err
configure:2327: $? = 0
configure:2330: test -s conftest.o
configure:2333: $? = 0
configure:2367: checking for style of include used by make
configure:2395: result: GNU
configure:2423: checking dependency style of g++
configure:2513: result: gcc3
configure:2543: checking for a BSD-compatible install
configure:2598: result: /usr/bin/install -c
configure:2609: checking whether make sets $(MAKE)
configure:2629: result: yes
configure:2685: checking for gcc
configure:2701: found /usr/bin/gcc
configure:2711: result: gcc
configure:2955: checking for C compiler version
configure:2958: gcc --version </dev/null >&5
gcc (GCC) 4.0.2 20050808 (prerelease) (Ubuntu 4.0.1-4ubuntu9)
Copyright (C) 2005 Free Software Foundation, Inc.
This is free software; see the source for copying conditions.  There is NO
warranty; not even for MERCHANTABILITY or FITNESS FOR A PARTICULAR PURPOSE.

configure:2961: $? = 0
configure:2963: gcc -v </dev/null >&5
Using built-in specs.
Target: i486-linux-gnu
Configured with: ../src/configure -v --enable-languages=c,c++,java,f95,objc,ada,treelang --prefix=/usr --with-gxx-include-dir=/usr/include/c++/4.0.2 --enable-shared --with-system-zlib --libexecdir=/usr/lib --enable-nls --without-included-gettext --enable-threads=posix --program-suffix=-4.0 --enable-__cxa_atexit --enable-libstdcxx-allocator=mt --enable-clocale=gnu --enable-libstdcxx-debug --enable-java-gc=boehm --enable-java-awt=gtk --enable-gtk-cairo --with-java-home=/usr/lib/jvm/java-1.4.2-gcj-4.0-1.4.2.0/jre --enable-mpfr --disable-werror --enable-checking=release i486-linux-gnu
Thread model: posix
gcc version 4.0.2 20050808 (prerelease) (Ubuntu 4.0.1-4ubuntu9)
configure:2966: $? = 0
configure:2968: gcc -V </dev/null >&5
gcc: '-V' option must have argument
configure:2971: $? = 1
configure:2974: checking whether we are using the GNU C compiler
configure:2998: gcc -c   conftest.c >&5
configure:3004: $? = 0
configure:3007: test -z 			 || test ! -s conftest.err
configure:3010: $? = 0
configure:3013: test -s conftest.o
configure:3016: $? = 0
configure:3029: result: yes
configure:3035: checking whether gcc accepts -g
configure:3056: gcc -c -g  conftest.c >&5
configure:3062: $? = 0
configure:3065: test -z 			 || test ! -s conftest.err
configure:3068: $? = 0
configure:3071: test -s conftest.o
configure:3074: $? = 0
configure:3085: result: yes
configure:3102: checking for gcc option to accept ANSI C
configure:3172: gcc  -c -g -O2  conftest.c >&5
configure:3178: $? = 0
configure:3181: test -z 			 || test ! -s conftest.err
configure:3184: $? = 0
configure:3187: test -s conftest.o
configure:3190: $? = 0
configure:3208: result: none needed
configure:3226: gcc -c -g -O2  conftest.c >&5
conftest.c:2: error: syntax error before 'me'
configure:3232: $? = 1
configure: failed program was:
| #ifndef __cplusplus
|   choke me
| #endif
configure:3364: checking dependency style of gcc
configure:3454: result: gcc3
configure:3472: checking for sys/wait.h that is POSIX.1 compatible
configure:3503: gcc -c -g -O2  conftest.c >&5
configure:3509: $? = 0
configure:3512: test -z 			 || test ! -s conftest.err
configure:3515: $? = 0
configure:3518: test -s conftest.o
configure:3521: $? = 0
configure:3532: result: yes
configure:3548: checking how to run the C preprocessor
configure:3583: gcc -E  conftest.c
configure:3589: $? = 0
configure:3621: gcc -E  conftest.c
conftest.c:15:28: error: ac_nonexistent.h: No such file or directory
configure:3627: $? = 1
configure: failed program was:
| /* confdefs.h.  */
| 
| #define PACKAGE_NAME "ossie_demo"
| #define PACKAGE_TARNAME "ossie_demo"
| #define PACKAGE_VERSION "0.0.1"
| #define PACKAGE_STRING "ossie_demo 0.0.1"
| #define PACKAGE_BUGREPORT ""
| #define PACKAGE "ossie_demo"
| #define VERSION "0.0.1"
| #ifdef __cplusplus
| extern "C" void std::exit (int) throw (); using std::exit;
| #endif
| #define HAVE_SYS_WAIT_H 1
| /* end confdefs.h.  */
| #include <ac_nonexistent.h>
configure:3666: result: gcc -E
configure:3690: gcc -E  conftest.c
configure:3696: $? = 0
configure:3728: gcc -E  conftest.c
conftest.c:15:28: error: ac_nonexistent.h: No such file or directory
configure:3734: $? = 1
configure: failed program was:
| /* confdefs.h.  */
| 
| #define PACKAGE_NAME "ossie_demo"
| #define PACKAGE_TARNAME "ossie_demo"
| #define PACKAGE_VERSION "0.0.1"
| #define PACKAGE_STRING "ossie_demo 0.0.1"
| #define PACKAGE_BUGREPORT ""
| #define PACKAGE "ossie_demo"
| #define VERSION "0.0.1"
| #ifdef __cplusplus
| extern "C" void std::exit (int) throw (); using std::exit;
| #endif
| #define HAVE_SYS_WAIT_H 1
| /* end confdefs.h.  */
| #include <ac_nonexistent.h>
configure:3778: checking for egrep
configure:3788: result: grep -E
configure:3793: checking for ANSI C header files
configure:3818: gcc -c -g -O2  conftest.c >&5
configure:3824: $? = 0
configure:3827: test -z 			 || test ! -s conftest.err
configure:3830: $? = 0
configure:3833: test -s conftest.o
configure:3836: $? = 0
configure:3925: gcc -o conftest -g -O2   conftest.c  >&5
conftest.c: In function 'main':
conftest.c:32: warning: incompatible implicit declaration of built-in function 'exit'
configure:3928: $? = 0
configure:3930: ./conftest
configure:3933: $? = 0
configure:3948: result: yes
configure:3972: checking for sys/types.h
configure:3988: gcc -c -g -O2  conftest.c >&5
configure:3994: $? = 0
configure:3997: test -z 			 || test ! -s conftest.err
configure:4000: $? = 0
configure:4003: test -s conftest.o
configure:4006: $? = 0
configure:4017: result: yes
configure:3972: checking for sys/stat.h
configure:3988: gcc -c -g -O2  conftest.c >&5
configure:3994: $? = 0
configure:3997: test -z 			 || test ! -s conftest.err
configure:4000: $? = 0
configure:4003: test -s conftest.o
configure:4006: $? = 0
configure:4017: result: yes
configure:3972: checking for stdlib.h
configure:3988: gcc -c -g -O2  conftest.c >&5
configure:3994: $? = 0
configure:3997: test -z 			 || test ! -s conftest.err
configure:4000: $? = 0
configure:4003: test -s conftest.o
configure:4006: $? = 0
configure:4017: result: yes
configure:3972: checking for string.h
configure:3988: gcc -c -g -O2  conftest.c >&5
configure:3994: $? = 0
configure:3997: test -z 			 || test ! -s conftest.err
configure:4000: $? = 0
configure:4003: test -s conftest.o
configure:4006: $? = 0
configure:4017: result: yes
configure:3972: checking for memory.h
configure:3988: gcc -c -g -O2  conftest.c >&5
configure:3994: $? = 0
configure:3997: test -z 			 || test ! -s conftest.err
configure:4000: $? = 0
configure:4003: test -s conftest.o
configure:4006: $? = 0
configure:4017: result: yes
configure:3972: checking for strings.h
configure:3988: gcc -c -g -O2  conftest.c >&5
configure:3994: $? = 0
configure:3997: test -z 			 || test ! -s conftest.err
configure:4000: $? = 0
configure:4003: test -s conftest.o
configure:4006: $? = 0
configure:4017: result: yes
configure:3972: checking for inttypes.h
configure:3988: gcc -c -g -O2  conftest.c >&5
configure:3994: $? = 0
configure:3997: test -z 			 || test ! -s conftest.err
configure:4000: $? = 0
configure:4003: test -s conftest.o
configure:4006: $? = 0
configure:4017: result: yes
configure:3972: checking for stdint.h
configure:3988: gcc -c -g -O2  conftest.c >&5
configure:3994: $? = 0
configure:3997: test -z 			 || test ! -s conftest.err
configure:4000: $? = 0
configure:4003: test -s conftest.o
configure:4006: $? = 0
configure:4017: result: yes
configure:3972: checking for unistd.h
configure:3988: gcc -c -g -O2  conftest.c >&5
configure:3994: $? = 0
configure:3997: test -z 			 || test ! -s conftest.err
configure:4000: $? = 0
configure:4003: test -s conftest.o
configure:4006: $? = 0
configure:4017: result: yes
configure:4029: checking for pid_t
configure:4053: gcc -c -g -O2  conftest.c >&5
configure:4059: $? = 0
configure:4062: test -z 			 || test ! -s conftest.err
configure:4065: $? = 0
configure:4068: test -s conftest.o
configure:4071: $? = 0
configure:4082: result: yes
configure:4100: checking for unistd.h
configure:4105: result: yes
configure:4109: checking vfork.h usability
configure:4121: gcc -c -g -O2  conftest.c >&5
conftest.c:60:19: error: vfork.h: No such file or directory
configure:4127: $? = 1
configure: failed program was:
| /* confdefs.h.  */
| 
| #define PACKAGE_NAME "ossie_demo"
| #define PACKAGE_TARNAME "ossie_demo"
| #define PACKAGE_VERSION "0.0.1"
| #define PACKAGE_STRING "ossie_demo 0.0.1"
| #define PACKAGE_BUGREPORT ""
| #define PACKAGE "ossie_demo"
| #define VERSION "0.0.1"
| #ifdef __cplusplus
| extern "C" void std::exit (int) throw (); using std::exit;
| #endif
| #define HAVE_SYS_WAIT_H 1
| #define STDC_HEADERS 1
| #define HAVE_SYS_TYPES_H 1
| #define HAVE_SYS_STAT_H 1
| #define HAVE_STDLIB_H 1
| #define HAVE_STRING_H 1
| #define HAVE_MEMORY_H 1
| #define HAVE_STRINGS_H 1
| #define HAVE_INTTYPES_H 1
| #define HAVE_STDINT_H 1
| #define HAVE_UNISTD_H 1
| #define HAVE_UNISTD_H 1
| /* end confdefs.h.  */
| #include <stdio.h>
| #if HAVE_SYS_TYPES_H
| # include <sys/types.h>
| #endif
| #if HAVE_SYS_STAT_H
| # include <sys/stat.h>
| #endif
| #if STDC_HEADERS
| # include <stdlib.h>
| # include <stddef.h>
| #else
| # if HAVE_STDLIB_H
| #  include <stdlib.h>
| # endif
| #endif
| #if HAVE_STRING_H
| # if !STDC_HEADERS && HAVE_MEMORY_H
| #  include <memory.h>
| # endif
| # include <string.h>
| #endif
| #if HAVE_STRINGS_H
| # include <strings.h>
| #endif
| #if HAVE_INTTYPES_H
| # include <inttypes.h>
| #else
| # if HAVE_STDINT_H
| #  include <stdint.h>
| # endif
| #endif
| #if HAVE_UNISTD_H
| # include <unistd.h>
| #endif
| #include <vfork.h>
configure:4149: result: no
configure:4153: checking vfork.h presence
configure:4163: gcc -E  conftest.c
conftest.c:26:19: error: vfork.h: No such file or directory
configure:4169: $? = 1
configure: failed program was:
| /* confdefs.h.  */
| 
| #define PACKAGE_NAME "ossie_demo"
| #define PACKAGE_TARNAME "ossie_demo"
| #define PACKAGE_VERSION "0.0.1"
| #define PACKAGE_STRING "ossie_demo 0.0.1"
| #define PACKAGE_BUGREPORT ""
| #define PACKAGE "ossie_demo"
| #define VERSION "0.0.1"
| #ifdef __cplusplus
| extern "C" void std::exit (int) throw (); using std::exit;
| #endif
| #define HAVE_SYS_WAIT_H 1
| #define STDC_HEADERS 1
| #define HAVE_SYS_TYPES_H 1
| #define HAVE_SYS_STAT_H 1
| #define HAVE_STDLIB_H 1
| #define HAVE_STRING_H 1
| #define HAVE_MEMORY_H 1
| #define HAVE_STRINGS_H 1
| #define HAVE_INTTYPES_H 1
| #define HAVE_STDINT_H 1
| #define HAVE_UNISTD_H 1
| #define HAVE_UNISTD_H 1
| /* end confdefs.h.  */
| #include <vfork.h>
configure:4189: result: no
configure:4224: checking for vfork.h
configure:4231: result: no
configure:4249: checking for fork
configure:4306: gcc -o conftest -g -O2   conftest.c  >&5
conftest.c:50: warning: conflicting types for built-in function 'fork'
configure:4312: $? = 0
configure:4315: test -z 			 || test ! -s conftest.err
configure:4318: $? = 0
configure:4321: test -s conftest
configure:4324: $? = 0
configure:4336: result: yes
configure:4249: checking for vfork
configure:4306: gcc -o conftest -g -O2   conftest.c  >&5
configure:4312: $? = 0
configure:4315: test -z 			 || test ! -s conftest.err
configure:4318: $? = 0
configure:4321: test -s conftest
configure:4324: $? = 0
configure:4336: result: yes
configure:4347: checking for working fork
configure:4370: gcc -o conftest -g -O2   conftest.c  >&5
conftest.c: In function 'main':
conftest.c:10: warning: incompatible implicit declaration of built-in function 'exit'
configure:4373: $? = 0
configure:4375: ./conftest
configure:4378: $? = 0
configure:4392: result: yes
configure:4413: checking for working vfork
configure:4546: result: yes
configure:4579: checking for libraries containing socket functions
configure:4612: gcc -o conftest -g -O2   conftest.c  >&5
configure:4618: $? = 0
configure:4621: test -z 			 || test ! -s conftest.err
configure:4624: $? = 0
configure:4627: test -s conftest
configure:4630: $? = 0
configure:4763: result: -lc
configure:4793: checking build system type
configure:4811: result: i686-pc-linux-gnu
configure:4819: checking host system type
configure:4833: result: i686-pc-linux-gnu
configure:4988: checking for the pthreads library -lpthreads
configure:5026: gcc -o conftest -g -O2    conftest.c -lpthreads  >&5
/usr/bin/ld: cannot find -lpthreads
collect2: ld returned 1 exit status
configure:5032: $? = 1
configure: failed program was:
| /* confdefs.h.  */
| 
| #define PACKAGE_NAME "ossie_demo"
| #define PACKAGE_TARNAME "ossie_demo"
| #define PACKAGE_VERSION "0.0.1"
| #define PACKAGE_STRING "ossie_demo 0.0.1"
| #define PACKAGE_BUGREPORT ""
| #define PACKAGE "ossie_demo"
| #define VERSION "0.0.1"
| #ifdef __cplusplus
| extern "C" void std::exit (int) throw (); using std::exit;
| #endif
| #define HAVE_SYS_WAIT_H 1
| #define STDC_HEADERS 1
| #define HAVE_SYS_TYPES_H 1
| #define HAVE_SYS_STAT_H 1
| #define HAVE_STDLIB_H 1
| #define HAVE_STRING_H 1
| #define HAVE_MEMORY_H 1
| #define HAVE_STRINGS_H 1
| #define HAVE_INTTYPES_H 1
| #define HAVE_STDINT_H 1
| #define HAVE_UNISTD_H 1
| #define HAVE_UNISTD_H 1
| #define HAVE_FORK 1
| #define HAVE_VFORK 1
| #define HAVE_WORKING_VFORK 1
| #define HAVE_WORKING_FORK 1
| /* end confdefs.h.  */
| #include <pthread.h>
| int
| main ()
| {
| pthread_t th; pthread_join(th, 0);
|                      pthread_attr_init(0); pthread_cleanup_push(0, 0);
|                      pthread_create(0,0,0,0); pthread_cleanup_pop(0);
|   ;
|   return 0;
| }
configure:5058: result: no
configure:4977: checking whether pthreads work without any flags
configure:5026: gcc -o conftest -g -O2    conftest.c   >&5
/tmp/ccGxglYp.o: In function `main':
/home/vrose/src/waveforms/ossie_demo/conftest.c:34: undefined reference to `pthread_join'
/home/vrose/src/waveforms/ossie_demo/conftest.c:35: undefined reference to `_pthread_cleanup_push'
/home/vrose/src/waveforms/ossie_demo/conftest.c:36: undefined reference to `pthread_create'
/home/vrose/src/waveforms/ossie_demo/conftest.c:36: undefined reference to `_pthread_cleanup_pop'
collect2: ld returned 1 exit status
configure:5032: $? = 1
configure: failed program was:
| /* confdefs.h.  */
| 
| #define PACKAGE_NAME "ossie_demo"
| #define PACKAGE_TARNAME "ossie_demo"
| #define PACKAGE_VERSION "0.0.1"
| #define PACKAGE_STRING "ossie_demo 0.0.1"
| #define PACKAGE_BUGREPORT ""
| #define PACKAGE "ossie_demo"
| #define VERSION "0.0.1"
| #ifdef __cplusplus
| extern "C" void std::exit (int) throw (); using std::exit;
| #endif
| #define HAVE_SYS_WAIT_H 1
| #define STDC_HEADERS 1
| #define HAVE_SYS_TYPES_H 1
| #define HAVE_SYS_STAT_H 1
| #define HAVE_STDLIB_H 1
| #define HAVE_STRING_H 1
| #define HAVE_MEMORY_H 1
| #define HAVE_STRINGS_H 1
| #define HAVE_INTTYPES_H 1
| #define HAVE_STDINT_H 1
| #define HAVE_UNISTD_H 1
| #define HAVE_UNISTD_H 1
| #define HAVE_FORK 1
| #define HAVE_VFORK 1
| #define HAVE_WORKING_VFORK 1
| #define HAVE_WORKING_FORK 1
| /* end confdefs.h.  */
| #include <pthread.h>
| int
| main ()
| {
| pthread_t th; pthread_join(th, 0);
|                      pthread_attr_init(0); pthread_cleanup_push(0, 0);
|                      pthread_create(0,0,0,0); pthread_cleanup_pop(0);
|   ;
|   return 0;
| }
configure:5058: result: no
configure:4982: checking whether pthreads work with -Kthread
configure:5026: gcc -o conftest -g -O2 -Kthread   conftest.c   >&5
gcc: unrecognized option '-Kthread'
/tmp/ccgQFURe.o: In function `main':
/home/vrose/src/waveforms/ossie_demo/conftest.c:34: undefined reference to `pthread_join'
/home/vrose/src/waveforms/ossie_demo/conftest.c:35: undefined reference to `_pthread_cleanup_push'
/home/vrose/src/waveforms/ossie_demo/conftest.c:36: undefined reference to `pthread_create'
/home/vrose/src/waveforms/ossie_demo/conftest.c:36: undefined reference to `_pthread_cleanup_pop'
collect2: ld returned 1 exit status
configure:5032: $? = 1
configure: failed program was:
| /* confdefs.h.  */
| 
| #define PACKAGE_NAME "ossie_demo"
| #define PACKAGE_TARNAME "ossie_demo"
| #define PACKAGE_VERSION "0.0.1"
| #define PACKAGE_STRING "ossie_demo 0.0.1"
| #define PACKAGE_BUGREPORT ""
| #define PACKAGE "ossie_demo"
| #define VERSION "0.0.1"
| #ifdef __cplusplus
| extern "C" void std::exit (int) throw (); using std::exit;
| #endif
| #define HAVE_SYS_WAIT_H 1
| #define STDC_HEADERS 1
| #define HAVE_SYS_TYPES_H 1
| #define HAVE_SYS_STAT_H 1
| #define HAVE_STDLIB_H 1
| #define HAVE_STRING_H 1
| #define HAVE_MEMORY_H 1
| #define HAVE_STRINGS_H 1
| #define HAVE_INTTYPES_H 1
| #define HAVE_STDINT_H 1
| #define HAVE_UNISTD_H 1
| #define HAVE_UNISTD_H 1
| #define HAVE_FORK 1
| #define HAVE_VFORK 1
| #define HAVE_WORKING_VFORK 1
| #define HAVE_WORKING_FORK 1
| /* end confdefs.h.  */
| #include <pthread.h>
| int
| main ()
| {
| pthread_t th; pthread_join(th, 0);
|                      pthread_attr_init(0); pthread_cleanup_push(0, 0);
|                      pthread_create(0,0,0,0); pthread_cleanup_pop(0);
|   ;
|   return 0;
| }
configure:5058: result: no
configure:4982: checking whether pthreads work with -kthread
configure:5026: gcc -o conftest -g -O2 -kthread   conftest.c   >&5
gcc: unrecognized option '-kthread'
/tmp/ccqYEnDm.o: In function `main':
/home/vrose/src/waveforms/ossie_demo/conftest.c:34: undefined reference to `pthread_join'
/home/vrose/src/waveforms/ossie_demo/conftest.c:35: undefined reference to `_pthread_cleanup_push'
/home/vrose/src/waveforms/ossie_demo/conftest.c:36: undefined reference to `pthread_create'
/home/vrose/src/waveforms/ossie_demo/conftest.c:36: undefined reference to `_pthread_cleanup_pop'
collect2: ld returned 1 exit status
configure:5032: $? = 1
configure: failed program was:
| /* confdefs.h.  */
| 
| #define PACKAGE_NAME "ossie_demo"
| #define PACKAGE_TARNAME "ossie_demo"
| #define PACKAGE_VERSION "0.0.1"
| #define PACKAGE_STRING "ossie_demo 0.0.1"
| #define PACKAGE_BUGREPORT ""
| #define PACKAGE "ossie_demo"
| #define VERSION "0.0.1"
| #ifdef __cplusplus
| extern "C" void std::exit (int) throw (); using std::exit;
| #endif
| #define HAVE_SYS_WAIT_H 1
| #define STDC_HEADERS 1
| #define HAVE_SYS_TYPES_H 1
| #define HAVE_SYS_STAT_H 1
| #define HAVE_STDLIB_H 1
| #define HAVE_STRING_H 1
| #define HAVE_MEMORY_H 1
| #define HAVE_STRINGS_H 1
| #define HAVE_INTTYPES_H 1
| #define HAVE_STDINT_H 1
| #define HAVE_UNISTD_H 1
| #define HAVE_UNISTD_H 1
| #define HAVE_FORK 1
| #define HAVE_VFORK 1
| #define HAVE_WORKING_VFORK 1
| #define HAVE_WORKING_FORK 1
| /* end confdefs.h.  */
| #include <pthread.h>
| int
| main ()
| {
| pthread_t th; pthread_join(th, 0);
|                      pthread_attr_init(0); pthread_cleanup_push(0, 0);
|                      pthread_create(0,0,0,0); pthread_cleanup_pop(0);
|   ;
|   return 0;
| }
configure:5058: result: no
configure:4988: checking for the pthreads library -llthread
configure:5026: gcc -o conftest -g -O2    conftest.c -llthread  >&5
/usr/bin/ld: cannot find -llthread
collect2: ld returned 1 exit status
configure:5032: $? = 1
configure: failed program was:
| /* confdefs.h.  */
| 
| #define PACKAGE_NAME "ossie_demo"
| #define PACKAGE_TARNAME "ossie_demo"
| #define PACKAGE_VERSION "0.0.1"
| #define PACKAGE_STRING "ossie_demo 0.0.1"
| #define PACKAGE_BUGREPORT ""
| #define PACKAGE "ossie_demo"
| #define VERSION "0.0.1"
| #ifdef __cplusplus
| extern "C" void std::exit (int) throw (); using std::exit;
| #endif
| #define HAVE_SYS_WAIT_H 1
| #define STDC_HEADERS 1
| #define HAVE_SYS_TYPES_H 1
| #define HAVE_SYS_STAT_H 1
| #define HAVE_STDLIB_H 1
| #define HAVE_STRING_H 1
| #define HAVE_MEMORY_H 1
| #define HAVE_STRINGS_H 1
| #define HAVE_INTTYPES_H 1
| #define HAVE_STDINT_H 1
| #define HAVE_UNISTD_H 1
| #define HAVE_UNISTD_H 1
| #define HAVE_FORK 1
| #define HAVE_VFORK 1
| #define HAVE_WORKING_VFORK 1
| #define HAVE_WORKING_FORK 1
| /* end confdefs.h.  */
| #include <pthread.h>
| int
| main ()
| {
| pthread_t th; pthread_join(th, 0);
|                      pthread_attr_init(0); pthread_cleanup_push(0, 0);
|                      pthread_create(0,0,0,0); pthread_cleanup_pop(0);
|   ;
|   return 0;
| }
configure:5058: result: no
configure:4982: checking whether pthreads work with -pthread
configure:5026: gcc -o conftest -g -O2 -pthread   conftest.c   >&5
configure:5032: $? = 0
configure:5035: test -z 			 || test ! -s conftest.err
configure:5038: $? = 0
configure:5041: test -s conftest
configure:5044: $? = 0
configure:5058: result: yes
configure:5078: checking for joinable pthread attribute
configure:5096: gcc -o conftest -g -O2 -pthread   conftest.c   >&5
configure:5102: $? = 0
configure:5105: test -z 			 || test ! -s conftest.err
configure:5108: $? = 0
configure:5111: test -s conftest
configure:5114: $? = 0
configure:5179: result: PTHREAD_CREATE_JOINABLE
configure:5186: checking if more special flags are required for pthreads
configure:5193: result: no
configure:5205: checking for cc_r
configure:5232: result: gcc
configure:5381: checking how to run the C++ preprocessor
configure:5412: g++ -E  conftest.cc
configure:5418: $? = 0
configure:5450: g++ -E  conftest.cc
conftest.cc:34:28: error: ac_nonexistent.h: No such file or directory
configure:5456: $? = 1
configure: failed program was:
| /* confdefs.h.  */
| 
| #define PACKAGE_NAME "ossie_demo"
| #define PACKAGE_TARNAME "ossie_demo"
| #define PACKAGE_VERSION "0.0.1"
| #define PACKAGE_STRING "ossie_demo 0.0.1"
| #define PACKAGE_BUGREPORT ""
| #define PACKAGE "ossie_demo"
| #define VERSION "0.0.1"
| #ifdef __cplusplus
| extern "C" void std::exit (int) throw (); using std::exit;
| #endif
| #define HAVE_SYS_WAIT_H 1
| #define STDC_HEADERS 1
| #define HAVE_SYS_TYPES_H 1
| #define HAVE_SYS_STAT_H 1
| #define HAVE_STDLIB_H 1
| #define HAVE_STRING_H 1
| #define HAVE_MEMORY_H 1
| #define HAVE_STRINGS_H 1
| #define HAVE_INTTYPES_H 1
| #define HAVE_STDINT_H 1
| #define HAVE_UNISTD_H 1
| #define HAVE_UNISTD_H 1
| #define HAVE_FORK 1
| #define HAVE_VFORK 1
| #define HAVE_WORKING_VFORK 1
| #define HAVE_WORKING_FORK 1
| #define HAVE_PTHREAD 1
| #define __linux__ 1
| #define __OSVERSION__ 2
| #define __x86__ 1
| /* end confdefs.h.  */
| #include <ac_nonexistent.h>
configure:5495: result: g++ -E
configure:5519: g++ -E  conftest.cc
configure:5525: $? = 0
configure:5557: g++ -E  conftest.cc
conftest.cc:34:28: error: ac_nonexistent.h: No such file or directory
configure:5563: $? = 1
configure: failed program was:
| /* confdefs.h.  */
| 
| #define PACKAGE_NAME "ossie_demo"
| #define PACKAGE_TARNAME "ossie_demo"
| #define PACKAGE_VERSION "0.0.1"
| #define PACKAGE_STRING "ossie_demo 0.0.1"
| #define PACKAGE_BUGREPORT ""
| #define PACKAGE "ossie_demo"
| #define VERSION "0.0.1"
| #ifdef __cplusplus
| extern "C" void std::exit (int) throw (); using std::exit;
| #endif
| #define HAVE_SYS_WAIT_H 1
| #define STDC_HEADERS 1
| #define HAVE_SYS_TYPES_H 1
| #define HAVE_SYS_STAT_H 1
| #define HAVE_STDLIB_H 1
| #define HAVE_STRING_H 1
| #define HAVE_MEMORY_H 1
| #define HAVE_STRINGS_H 1
| #define HAVE_INTTYPES_H 1
| #define HAVE_STDINT_H 1
| #define HAVE_UNISTD_H 1
| #define HAVE_UNISTD_H 1
| #define HAVE_FORK 1
| #define HAVE_VFORK 1
| #define HAVE_WORKING_VFORK 1
| #define HAVE_WORKING_FORK 1
| #define HAVE_PTHREAD 1
| #define __linux__ 1
| #define __OSVERSION__ 2
| #define __x86__ 1
| /* end confdefs.h.  */
| #include <ac_nonexistent.h>
configure:5622: checking for omniORB4
configure:5711: g++ -E  -pthread -I/usr/local/include conftest.cc
configure:5717: $? = 0
configure:5856: g++ -o conftest -g -O2  -pthread -I/usr/local/include  -pthread  -L/usr/local/lib conftest.cc  -lomniORB4 -lomniDynamic4 -lomnithread >&5
configure:5862: $? = 0
configure:5865: test -z 			 || test ! -s conftest.err
configure:5868: $? = 0
configure:5871: test -s conftest
configure:5874: $? = 0
configure:5959: result: /usr/local/include
configure:5983: checking for omniidl
configure:6043: result: /usr/local/bin/omniidl
configure:6049: /usr/local/bin/omniidl -bcxx -Wbh=.hh conftest.idl
configure:6052: $? = 0
configure:6551: checking for pkg-config
configure:6569: found /usr/bin/pkg-config
configure:6581: result: /usr/bin/pkg-config
configure:6596: checking pkg-config is at least version 0.9.0
configure:6599: result: yes
configure:6610: checking for OSSIE
configure:6615: $PKG_CONFIG --exists --print-errors "ossie >= 0.0.1"
configure:6618: $? = 0
configure:6629: $PKG_CONFIG --exists --print-errors "ossie >= 0.0.1"
configure:6632: $? = 0
configure:6653: result: yes
configure:6664: checking for SI
configure:6669: $PKG_CONFIG --exists --print-errors "standardInterfaces >= 0.0.1"
Package standardInterfaces was not found in the pkg-config search path.
Perhaps you should add the directory containing `standardInterfaces.pc'
to the PKG_CONFIG_PATH environment variable
No package 'standardInterfaces' found
configure:6672: $? = 1
configure:6683: $PKG_CONFIG --exists --print-errors "standardInterfaces >= 0.0.1"
Package standardInterfaces was not found in the pkg-config search path.
Perhaps you should add the directory containing `standardInterfaces.pc'
to the PKG_CONFIG_PATH environment variable
No package 'standardInterfaces' found
configure:6686: $? = 1
Package standardInterfaces was not found in the pkg-config search path.
Perhaps you should add the directory containing `standardInterfaces.pc'
to the PKG_CONFIG_PATH environment variable
No package 'standardInterfaces' found

## ---------------- ##
## Cache variables. ##
## ---------------- ##

ac_cv_build=i686-pc-linux-gnu
ac_cv_build_alias=i686-pc-linux-gnu
ac_cv_c_compiler_gnu=yes
ac_cv_corba_omniorb4=/usr/local/include
ac_cv_cxx_compiler_gnu=yes
ac_cv_env_CC_set=
ac_cv_env_CC_value=
ac_cv_env_CFLAGS_set=
ac_cv_env_CFLAGS_value=
ac_cv_env_CPPFLAGS_set=
ac_cv_env_CPPFLAGS_value=
ac_cv_env_CPP_set=
ac_cv_env_CPP_value=
ac_cv_env_CXXCPP_set=
ac_cv_env_CXXCPP_value=
ac_cv_env_CXXFLAGS_set=
ac_cv_env_CXXFLAGS_value=
ac_cv_env_CXX_set=
ac_cv_env_CXX_value=
ac_cv_env_LDFLAGS_set=
ac_cv_env_LDFLAGS_value=
ac_cv_env_OSSIE_CFLAGS_set=
ac_cv_env_OSSIE_CFLAGS_value=
ac_cv_env_OSSIE_LIBS_set=
ac_cv_env_OSSIE_LIBS_value=
ac_cv_env_PKG_CONFIG_set=
ac_cv_env_PKG_CONFIG_value=
ac_cv_env_SI_CFLAGS_set=
ac_cv_env_SI_CFLAGS_value=
ac_cv_env_SI_LIBS_set=
ac_cv_env_SI_LIBS_value=
ac_cv_env_build_alias_set=
ac_cv_env_build_alias_value=
ac_cv_env_host_alias_set=
ac_cv_env_host_alias_value=
ac_cv_env_target_alias_set=
ac_cv_env_target_alias_value=
ac_cv_exeext=
ac_cv_func_fork=yes
ac_cv_func_fork_works=yes
ac_cv_func_vfork=yes
ac_cv_func_vfork_works=yes
ac_cv_header_inttypes_h=yes
ac_cv_header_memory_h=yes
ac_cv_header_stdc=yes
ac_cv_header_stdint_h=yes
ac_cv_header_stdlib_h=yes
ac_cv_header_string_h=yes
ac_cv_header_strings_h=yes
ac_cv_header_sys_stat_h=yes
ac_cv_header_sys_types_h=yes
ac_cv_header_sys_wait_h=yes
ac_cv_header_unistd_h=yes
ac_cv_header_vfork_h=no
ac_cv_host=i686-pc-linux-gnu
ac_cv_host_alias=i686-pc-linux-gnu
ac_cv_objext=o
ac_cv_path_IDL=/usr/local/bin/omniidl
ac_cv_path_ac_pt_PKG_CONFIG=/usr/bin/pkg-config
ac_cv_path_install='/usr/bin/install -c'
ac_cv_prog_AWK=gawk
ac_cv_prog_CPP='gcc -E'
ac_cv_prog_CXXCPP='g++ -E'
ac_cv_prog_PTHREAD_CC=gcc
ac_cv_prog_ac_ct_CC=gcc
ac_cv_prog_ac_ct_CXX=g++
ac_cv_prog_cc_g=yes
ac_cv_prog_cc_stdc=
ac_cv_prog_cxx_g=yes
ac_cv_prog_egrep='grep -E'
ac_cv_prog_make_make_set=yes
ac_cv_socket_libs=-lc
ac_cv_type_pid_t=yes
am_cv_CC_dependencies_compiler_type=gcc3
am_cv_CXX_dependencies_compiler_type=gcc3
pkg_cv_OSSIE_CFLAGS='-I/usr/local/include  '
pkg_cv_OSSIE_LIBS='-L/usr/local/lib -lossieidl -lossieparser -lossiecf  '

## ----------------- ##
## Output variables. ##
## ----------------- ##

ACLOCAL='${SHELL} /home/vrose/src/waveforms/ossie_demo/missing --run aclocal-1.9'
AMDEPBACKSLASH='\'
AMDEP_FALSE='#'
AMDEP_TRUE=''
AMTAR='${SHELL} /home/vrose/src/waveforms/ossie_demo/missing --run tar'
AUTOCONF='${SHELL} /home/vrose/src/waveforms/ossie_demo/missing --run autoconf'
AUTOHEADER='${SHELL} /home/vrose/src/waveforms/ossie_demo/missing --run autoheader'
AUTOMAKE='${SHELL} /home/vrose/src/waveforms/ossie_demo/missing --run automake-1.9'
AWK='gawk'
CC='gcc'
CCDEPMODE='depmode=gcc3'
CFLAGS='-g -O2'
CORBA_ORB='omniORB4'
CPP='gcc -E'
CPPFLAGS=' -pthread -I/usr/local/include'
CXX='g++'
CXXCPP='g++ -E'
CXXDEPMODE='depmode=gcc3'
CXXFLAGS='-g -O2 -I/usr/local/include  '
CYGPATH_W='echo'
DEFS=''
DEPDIR='.deps'
ECHO_C=''
ECHO_N='-n'
ECHO_T=''
EGREP='grep -E'
ETR_SOCKET_LIBS=''
EXEEXT=''
IDL='/usr/local/bin/omniidl'
IDL_CPPFLAGS=''
IDL_FLAGS='-I/usr/local/include  '
INSTALL_DATA='${INSTALL} -m 644'
INSTALL_PROGRAM='${INSTALL}'
INSTALL_SCRIPT='${INSTALL}'
INSTALL_STRIP_PROGRAM='${SHELL} $(install_sh) -c -s'
LDFLAGS=' -pthread  -L/usr/local/lib'
LIBOBJS=''
LIBS=' -lomniORB4 -lomniDynamic4 -lomnithread -L/usr/local/lib -lossieidl -lossieparser -lossiecf  '
LTLIBOBJS=''
MAKEINFO='${SHELL} /home/vrose/src/waveforms/ossie_demo/missing --run makeinfo'
OBJEXT='o'
OSSIE_CFLAGS='-I/usr/local/include  '
OSSIE_LIBS='-L/usr/local/lib -lossieidl -lossieparser -lossiecf  '
OSVERSION='2'
PACKAGE='ossie_demo'
PACKAGE_BUGREPORT=''
PACKAGE_NAME='ossie_demo'
PACKAGE_STRING='ossie_demo 0.0.1'
PACKAGE_TARNAME='ossie_demo'
PACKAGE_VERSION='0.0.1'
PATH_SEPARATOR=':'
PKG_CONFIG='/usr/bin/pkg-config'
PLATFORM_DEFINITION='__linux__'
PLATFORM_NAME='Linux'
PROCESSOR_DEFINITION='__x86__'
PROCESSOR_NAME='x86Processor'
PTHREAD_CC='gcc'
PTHREAD_CFLAGS='-pthread'
PTHREAD_LIBS=''
SET_MAKE=''
SHELL='/bin/sh'
SI_CFLAGS=''
SI_LIBS=''
SI_PATH=''
STRIP=''
VERSION='0.0.1'
ac_ct_CC='gcc'
ac_ct_CXX='g++'
ac_ct_STRIP=''
ac_pt_PKG_CONFIG='/usr/bin/pkg-config'
am__fastdepCC_FALSE='#'
am__fastdepCC_TRUE=''
am__fastdepCXX_FALSE='#'
am__fastdepCXX_TRUE=''
am__include='include'
am__leading_dot='.'
am__quote=''
am__tar='${AMTAR} chof - "$$tardir"'
am__untar='${AMTAR} xf -'
bindir='${exec_prefix}/bin'
build='i686-pc-linux-gnu'
build_alias=''
build_cpu='i686'
build_os='linux-gnu'
build_vendor='pc'
datadir='${prefix}/share'
exec_prefix='NONE'
host='i686-pc-linux-gnu'
host_alias=''
host_cpu='i686'
host_os='linux-gnu'
host_vendor='pc'
includedir='${prefix}/include'
infodir='${prefix}/info'
install_sh='/home/vrose/src/waveforms/ossie_demo/install-sh'
libdir='${exec_prefix}/lib'
libexecdir='${exec_prefix}/libexec'
localstatedir='${prefix}/var'
mandir='${prefix}/man'
mkdir_p='mkdir -p --'
oldincludedir='/usr/include'
prefix='NONE'
program_transform_name='s,x,x,'
sbindir='${exec_prefix}/sbin'
sharedstatedir='${prefix}/com'
sysconfdir='${prefix}/etc'
target_alias=''

## ----------- ##
## confdefs.h. ##
## ----------- ##

#define HAVE_FORK 1
#define HAVE_INTTYPES_H 1
#define HAVE_MEMORY_H 1
#define HAVE_OMNIORB4 1
#define HAVE_PTHREAD 1
#define HAVE_STDINT_H 1
#define HAVE_STDLIB_H 1
#define HAVE_STRINGS_H 1
#define HAVE_STRING_H 1
#define HAVE_SYS_STAT_H 1
#define HAVE_SYS_TYPES_H 1
#define HAVE_SYS_WAIT_H 1
#define HAVE_UNISTD_H 1
#define HAVE_UNISTD_H 1
#define HAVE_VFORK 1
#define HAVE_WORKING_FORK 1
#define HAVE_WORKING_VFORK 1
#define PACKAGE "ossie_demo"
#define PACKAGE_BUGREPORT ""
#define PACKAGE_NAME "ossie_demo"
#define PACKAGE_STRING "ossie_demo 0.0.1"
#define PACKAGE_TARNAME "ossie_demo"
#define PACKAGE_VERSION "0.0.1"
#define STDC_HEADERS 1
#define VERSION "0.0.1"
#define __OSVERSION__ 2
#define __linux__ 1
#define __x86__ 1
#endif
#ifdef __cplusplus
extern "C" void std::exit (int) throw (); using std::exit;

configure: exit 0