All pastes #418162 Raw Edit

Unnamed

public text v1 · immutable
#418162 ·published 2007-03-31 13:09 UTC
rendered paste body
gcc -DHAVE_CONFIG_H -I. -I. -I../../.. -I../../../src/lib/ecore -I../../../src/lib/ecore_evas -I../../../src/lib/ecore -I../../../src/lib/ecore_evas -I../../../src/lib/ecore_x -I/usr/local/include -I/usr/local/include -g -O2 -Wall -MT ecore_evas_x.lo -MD -MP -MF .deps/ecore_evas_x.Tpo -c ecore_evas_x.c  -fPIC -DPIC -o .libs/ecore_evas_x.o
ecore_evas_x.c: In function 'ecore_evas_xrender_x11_new':
ecore_evas_x.c:2507: error: 'Evas_Engine_Info_XRender_X11' undeclared (first use in this function)
ecore_evas_x.c:2507: error: (Each undeclared identifier is reported only once
ecore_evas_x.c:2507: error: for each function it appears in.)
ecore_evas_x.c:2507: error: 'einfo' undeclared (first use in this function)
ecore_evas_x.c:2513: warning: implicit declaration of function 'ecore_x_init'
ecore_evas_x.c:2519: warning: implicit declaration of function '_ecore_evas_x_init'
ecore_evas_x.c:2521: error: '_ecore_x_engine_func' undeclared (first use in this function)
ecore_evas_x.c:2538: error: 'Ecore_Evas_Engine' has no member named 'x'
ecore_evas_x.c:2547: error: 'Ecore_Evas_Engine' has no member named 'x'
ecore_evas_x.c:2548: error: 'Ecore_Evas_Engine' has no member named 'x'
ecore_evas_x.c:2548: warning: implicit declaration of function 'ecore_x_window_new'
ecore_evas_x.c:2551: warning: implicit declaration of function 'ecore_x_netwm_startup_id_set'
ecore_evas_x.c:2551: error: 'Ecore_Evas_Engine' has no member named 'x'
ecore_evas_x.c:2558: error: expected expression before ')' token
ecore_evas_x.c:2564: warning: implicit declaration of function 'DefaultScreen'
ecore_evas_x.c:2564: warning: implicit declaration of function 'ecore_x_display_get'
ecore_evas_x.c:2565: warning: implicit declaration of function 'ScreenCount'
ecore_evas_x.c:2571: warning: implicit declaration of function 'ecore_x_window_root_list'
ecore_evas_x.c:2571: warning: assignment makes pointer from integer without a cast
ecore_evas_x.c:2574: error: 'XWindowAttributes' undeclared (first use in this function)
ecore_evas_x.c:2574: error: expected ';' before 'at'
ecore_evas_x.c:2576: warning: implicit declaration of function 'XGetWindowAttributes'
ecore_evas_x.c:2577: error: 'at' undeclared (first use in this function)
ecore_evas_x.c:2592: warning: implicit declaration of function 'DefaultVisual'
ecore_evas_x.c:2593: error: 'Ecore_Evas_Engine' has no member named 'x'
ecore_evas_x.c:2606: error: 'ecore_evases' undeclared (first use in this function)
ecore_evas_x.c:2607: error: 'ecore_evases_hash' undeclared (first use in this function)
ecore_evas_x.c:2607: warning: implicit declaration of function '_ecore_evas_x_winid_str_get'
ecore_evas_x.c:2607: error: 'Ecore_Evas_Engine' has no member named 'x'
ecore_evas_x.c:2607: warning: passing argument 2 of 'evas_hash_add' makes pointer from integer without a cast
make[4]: *** [ecore_evas_x.lo] Error 1