All pastes #417071 Raw Edit

Something

public text v1 · immutable
#417071 ·published 2007-03-30 18:38 UTC
rendered paste body
gdft.c:1401:35: fontconfig/fontconfig.h: No such file or directory
gdft.c:1464: error: syntax error before '*' token
gdft.c:1464: error: syntax error before '*' token
gdft.c: In function `find_font':
gdft.c:1466: error: `FcResult' undeclared (first use in this function)
gdft.c:1466: error: (Each undeclared identifier is reported only once
gdft.c:1466: error: for each function it appears in.)
gdft.c:1466: error: syntax error before "result"
gdft.c:1468: error: `pattern' undeclared (first use in this function)
gdft.c:1468: error: `FcMatchPattern' undeclared (first use in this function)
gdft.c:1469: error: `FcMatchFont' undeclared (first use in this function)
gdft.c:1472: error: `result' undeclared (first use in this function)
gdft.c:1472: warning: return makes pointer from integer without a cast
gdft.c: At top level:
gdft.c:1477: error: syntax error before '*' token
gdft.c: In function `find_postscript_font':
gdft.c:1479: error: `FcPattern' undeclared (first use in this function)
gdft.c:1479: error: `font' undeclared (first use in this function)
gdft.c:1482: error: `fontpattern' undeclared (first use in this function)
gdft.c:1484: error: `fontname' undeclared (first use in this function)
gdft.c:1485: error: `FcChar8' undeclared (first use in this function)
gdft.c:1485: error: `family' undeclared (first use in this function)
gdft.c:1487: error: `pattern' undeclared (first use in this function)
gdft.c:1489: error: `FC_FAMILY' undeclared (first use in this function)
gdft.c:1489: error: `FcTypeString' undeclared (first use in this function)
gdft.c:1490: error: `FC_STYLE' undeclared (first use in this function)
gdft.c:1495: error: `FcResultMatch' undeclared (first use in this function)
gdft.c: In function `font_pattern':
gdft.c:1514: error: `FcPattern' undeclared (first use in this function)
gdft.c:1514: error: `font' undeclared (first use in this function)
gdft.c:1515: error: `FcChar8' undeclared (first use in this function)
gdft.c:1515: error: `file' undeclared (first use in this function)
gdft.c:1516: error: `pattern' undeclared (first use in this function)
gdft.c:1529: error: syntax error before "FcChar8"
gdft.c:1536: error: `FC_FILE' undeclared (first use in this function)
gdft.c:1536: error: `FcResultMatch' undeclared (first use in this function)
make[2]: *** [gdft.lo] Error 1
make[2]: Leaving directory `/home/janc/download/temp_source/gd-2.0.34'
make[1]: *** [all-recursive] Error 1
make[1]: Leaving directory `/home/janc/download/temp_source/gd-2.0.34'
make: *** [all] Error 2