All pastes #417035 Raw Edit

Unnamed

public text v1 · immutable
#417035 ·published 2007-03-30 18:04 UTC
rendered paste body

======================================================================
FAIL: test.rdfa.all_tests:()
----------------------------------------------------------------------
Traceback (most recent call last):
  File "/usr/lib/python2.4/site-packages/nose-0.9.2-py2.4.egg/nose/case.py", line 52, in runTest
    self.testFunc()
  File "/usr/lib/python2.4/site-packages/nose-0.9.2-py2.4.egg/nose/loader.py", line 326, in run
    expr[0](*expr[1:])
  File "/home/eliast/work/rdflib-trunk/test/rdfa.py", line 91, in runTest
    "In %s: results do not match.\n%s\n\n%s" % (self.shortDescription(), pcontents, qcontents))
AssertionError: In 000005: results do not match.
<http://internet-apps.blogspot.com/> <http://purl.org/dc/elements/1.1/title> "Internet Applications".
<http://internet-apps.blogspot.com/> <http://purl.org/dc/elements/1.1/creator> <http://www.blogger.com/profile/1109404>.


<http://example.com/> <http://purl.org/dc/elements/1.1/creator> <http://www.blogger.com/profile/1109404>.
_:span0 <http://purl.org/dc/elements/1.1/title> "Internet Applications".


======================================================================
FAIL: /home/eliast/work/rdflib-trunk: test.rdfa.all_tests:()
----------------------------------------------------------------------
Traceback (most recent call last):
  File "/usr/lib/python2.4/site-packages/nose-0.9.2-py2.4.egg/nose/case.py", line 52, in runTest
    self.testFunc()
  File "/usr/lib/python2.4/site-packages/nose-0.9.2-py2.4.egg/nose/loader.py", line 326, in run
    expr[0](*expr[1:])
  File "/home/eliast/work/rdflib-trunk/test/rdfa.py", line 91, in runTest
    "In %s: results do not match.\n%s\n\n%s" % (self.shortDescription(), pcontents, qcontents))
AssertionError: In 000014: results do not match.
<http://example.org/node> <http://example.org/property> "chat"@fr.


<http://example.org/node> <http://example.org/property> "chat".


======================================================================
FAIL: /home/eliast/work/rdflib-trunk: test.rdfa.all_tests:()
----------------------------------------------------------------------
Traceback (most recent call last):
  File "/usr/lib/python2.4/site-packages/nose-0.9.2-py2.4.egg/nose/case.py", line 52, in runTest
    self.testFunc()
  File "/usr/lib/python2.4/site-packages/nose-0.9.2-py2.4.egg/nose/loader.py", line 326, in run
    expr[0](*expr[1:])
  File "/home/eliast/work/rdflib-trunk/test/rdfa.py", line 91, in runTest
    "In %s: results do not match.\n%s\n\n%s" % (self.shortDescription(), pcontents, qcontents))
AssertionError: In 000015: results do not match.
<http://example.org/node> <http://example.org/property> "chat"@fr.


<http://example.org/node> <http://example.org/property> "chat".


----------------------------------------------------------------------
Ran 122 tests in 24.863s

FAILED (failures=6, errors=38)