rendered paste bodyThis file contains any messages produced by compilers while
running configure, to aid debugging if configure makes a mistake.
It was created by ossie configure 0.0.4-13JAN2006, which was
generated by GNU Autoconf 2.59. Invocation command line was
$ ./configure
## --------- ##
## Platform. ##
## --------- ##
hostname = ubuntu-jsimone
uname -m = i686
uname -r = 2.6.12-9-386
uname -s = Linux
uname -v = #1 Mon Oct 10 13:14:36 BST 2005
/usr/bin/uname -p = unknown
/bin/uname -X = unknown
/bin/arch = i686
/usr/bin/arch -k = unknown
/usr/convex/getsysinfo = unknown
hostinfo = unknown
/bin/machine = unknown
/usr/bin/oslevel = unknown
/bin/universe = unknown
PATH: /usr/local/bin
PATH: /usr/local/sbin
PATH: /sbin
PATH: /usr/sbin
PATH: /bin
PATH: /usr/bin
PATH: /usr/bin/X11
PATH: /usr/games
## ----------- ##
## Core tests. ##
## ----------- ##
configure:1556: checking for a BSD-compatible install
configure:1611: result: /usr/bin/install -c
configure:1622: checking whether build environment is sane
configure:1665: result: yes
configure:1730: checking for gawk
configure:1746: found /usr/bin/gawk
configure:1756: result: gawk
configure:1766: checking whether make sets $(MAKE)
configure:1786: result: yes
configure:2007: checking for g++
configure:2023: found /usr/bin/g++
configure:2033: result: g++
configure:2049: checking for C++ compiler version
configure:2052: g++ --version </dev/null >&5
g++ (GCC) 4.0.2 20050808 (prerelease) (Ubuntu 4.0.1-4ubuntu9)
Copyright (C) 2005 Free Software Foundation, Inc.
This is free software; see the source for copying conditions. There is NO
warranty; not even for MERCHANTABILITY or FITNESS FOR A PARTICULAR PURPOSE.
configure:2055: $? = 0
configure:2057: g++ -v </dev/null >&5
Using built-in specs.
Target: i486-linux-gnu
Configured with: ../src/configure -v --enable-languages=c,c++,java,f95,objc,ada,treelang --prefix=/usr --with-gxx-include-dir=/usr/include/c++/4.0.2 --enable-shared --with-system-zlib --libexecdir=/usr/lib --enable-nls --without-included-gettext --enable-threads=posix --program-suffix=-4.0 --enable-__cxa_atexit --enable-libstdcxx-allocator=mt --enable-clocale=gnu --enable-libstdcxx-debug --enable-java-gc=boehm --enable-java-awt=gtk --enable-gtk-cairo --with-java-home=/usr/lib/jvm/java-1.4.2-gcj-4.0-1.4.2.0/jre --enable-mpfr --disable-werror --enable-checking=release i486-linux-gnu
Thread model: posix
gcc version 4.0.2 20050808 (prerelease) (Ubuntu 4.0.1-4ubuntu9)
configure:2060: $? = 0
configure:2062: g++ -V </dev/null >&5
g++: '-V' option must have argument
configure:2065: $? = 1
configure:2088: checking for C++ compiler default output file name
configure:2091: g++ conftest.cc >&5
configure:2094: $? = 0
configure:2140: result: a.out
configure:2145: checking whether the C++ compiler works
configure:2151: ./a.out
configure:2154: $? = 0
configure:2171: result: yes
configure:2178: checking whether we are cross compiling
configure:2180: result: no
configure:2183: checking for suffix of executables
configure:2185: g++ -o conftest conftest.cc >&5
configure:2188: $? = 0
configure:2213: result:
configure:2219: checking for suffix of object files
configure:2240: g++ -c conftest.cc >&5
configure:2243: $? = 0
configure:2265: result: o
configure:2269: checking whether we are using the GNU C++ compiler
configure:2293: g++ -c conftest.cc >&5
configure:2299: $? = 0
configure:2302: test -z || test ! -s conftest.err
configure:2305: $? = 0
configure:2308: test -s conftest.o
configure:2311: $? = 0
configure:2324: result: yes
configure:2330: checking whether g++ accepts -g
configure:2351: g++ -c -g conftest.cc >&5
configure:2357: $? = 0
configure:2360: test -z || test ! -s conftest.err
configure:2363: $? = 0
configure:2366: test -s conftest.o
configure:2369: $? = 0
configure:2380: result: yes
configure:2422: g++ -c -g -O2 conftest.cc >&5
configure:2428: $? = 0
configure:2431: test -z || test ! -s conftest.err
configure:2434: $? = 0
configure:2437: test -s conftest.o
configure:2440: $? = 0
configure:2466: g++ -c -g -O2 conftest.cc >&5
conftest.cc: In function 'int main()':
conftest.cc:15: error: 'exit' was not declared in this scope
configure:2472: $? = 1
configure: failed program was:
| /* confdefs.h. */
|
| #define PACKAGE_NAME "ossie"
| #define PACKAGE_TARNAME "ossie"
| #define PACKAGE_VERSION "0.0.4-13JAN2006"
| #define PACKAGE_STRING "ossie 0.0.4-13JAN2006"
| #define PACKAGE_BUGREPORT ""
| #define PACKAGE "ossie"
| #define VERSION "0.0.4-13JAN2006"
| /* end confdefs.h. */
|
| int
| main ()
| {
| exit (42);
| ;
| return 0;
| }
configure:2422: g++ -c -g -O2 conftest.cc >&5
configure:2428: $? = 0
configure:2431: test -z || test ! -s conftest.err
configure:2434: $? = 0
configure:2437: test -s conftest.o
configure:2440: $? = 0
configure:2466: g++ -c -g -O2 conftest.cc >&5
configure:2472: $? = 0
configure:2475: test -z || test ! -s conftest.err
configure:2478: $? = 0
configure:2481: test -s conftest.o
configure:2484: $? = 0
configure:2518: checking for style of include used by make
configure:2546: result: GNU
configure:2574: checking dependency style of g++
configure:2664: result: gcc3
configure:2694: checking for a BSD-compatible install
configure:2749: result: /usr/bin/install -c
configure:2760: checking whether make sets $(MAKE)
configure:2780: result: yes
configure:2867: checking build system type
configure:2885: result: i686-pc-linux-gnu
configure:2893: checking host system type
configure:2907: result: i686-pc-linux-gnu
configure:2961: checking for gcc
configure:2977: found /usr/bin/gcc
configure:2987: result: gcc
configure:3231: checking for C compiler version
configure:3234: gcc --version </dev/null >&5
gcc (GCC) 4.0.2 20050808 (prerelease) (Ubuntu 4.0.1-4ubuntu9)
Copyright (C) 2005 Free Software Foundation, Inc.
This is free software; see the source for copying conditions. There is NO
warranty; not even for MERCHANTABILITY or FITNESS FOR A PARTICULAR PURPOSE.
configure:3237: $? = 0
configure:3239: gcc -v </dev/null >&5
Using built-in specs.
Target: i486-linux-gnu
Configured with: ../src/configure -v --enable-languages=c,c++,java,f95,objc,ada,treelang --prefix=/usr --with-gxx-include-dir=/usr/include/c++/4.0.2 --enable-shared --with-system-zlib --libexecdir=/usr/lib --enable-nls --without-included-gettext --enable-threads=posix --program-suffix=-4.0 --enable-__cxa_atexit --enable-libstdcxx-allocator=mt --enable-clocale=gnu --enable-libstdcxx-debug --enable-java-gc=boehm --enable-java-awt=gtk --enable-gtk-cairo --with-java-home=/usr/lib/jvm/java-1.4.2-gcj-4.0-1.4.2.0/jre --enable-mpfr --disable-werror --enable-checking=release i486-linux-gnu
Thread model: posix
gcc version 4.0.2 20050808 (prerelease) (Ubuntu 4.0.1-4ubuntu9)
configure:3242: $? = 0
configure:3244: gcc -V </dev/null >&5
gcc: '-V' option must have argument
configure:3247: $? = 1
configure:3250: checking whether we are using the GNU C compiler
configure:3274: gcc -c conftest.c >&5
configure:3280: $? = 0
configure:3283: test -z || test ! -s conftest.err
configure:3286: $? = 0
configure:3289: test -s conftest.o
configure:3292: $? = 0
configure:3305: result: yes
configure:3311: checking whether gcc accepts -g
configure:3332: gcc -c -g conftest.c >&5
configure:3338: $? = 0
configure:3341: test -z || test ! -s conftest.err
configure:3344: $? = 0
configure:3347: test -s conftest.o
configure:3350: $? = 0
configure:3361: result: yes
configure:3378: checking for gcc option to accept ANSI C
configure:3448: gcc -c -g -O2 conftest.c >&5
configure:3454: $? = 0
configure:3457: test -z || test ! -s conftest.err
configure:3460: $? = 0
configure:3463: test -s conftest.o
configure:3466: $? = 0
configure:3484: result: none needed
configure:3502: gcc -c -g -O2 conftest.c >&5
conftest.c:2: error: syntax error before 'me'
configure:3508: $? = 1
configure: failed program was:
| #ifndef __cplusplus
| choke me
| #endif
configure:3640: checking dependency style of gcc
configure:3730: result: gcc3
configure:3747: checking for a sed that does not truncate output
configure:3801: result: /bin/sed
configure:3804: checking for egrep
configure:3814: result: grep -E
configure:3830: checking for ld used by gcc
configure:3897: result: /usr/bin/ld
configure:3906: checking if the linker (/usr/bin/ld) is GNU ld
configure:3921: result: yes
configure:3926: checking for /usr/bin/ld option to reload object files
configure:3933: result: -r
configure:3942: checking for BSD-compatible nm
configure:3984: result: /usr/bin/nm -B
configure:3988: checking whether ln -s works
configure:3992: result: yes
configure:3999: checking how to recognise dependent libraries
configure:4173: result: pass_all
configure:4386: checking how to run the C preprocessor
configure:4421: gcc -E conftest.c
configure:4427: $? = 0
configure:4459: gcc -E conftest.c
conftest.c:14:28: error: ac_nonexistent.h: No such file or directory
configure:4465: $? = 1
configure: failed program was:
| /* confdefs.h. */
|
| #define PACKAGE_NAME "ossie"
| #define PACKAGE_TARNAME "ossie"
| #define PACKAGE_VERSION "0.0.4-13JAN2006"
| #define PACKAGE_STRING "ossie 0.0.4-13JAN2006"
| #define PACKAGE_BUGREPORT ""
| #define PACKAGE "ossie"
| #define VERSION "0.0.4-13JAN2006"
| #ifdef __cplusplus
| extern "C" void std::exit (int) throw (); using std::exit;
| #endif
| /* end confdefs.h. */
| #include <ac_nonexistent.h>
configure:4504: result: gcc -E
configure:4528: gcc -E conftest.c
configure:4534: $? = 0
configure:4566: gcc -E conftest.c
conftest.c:14:28: error: ac_nonexistent.h: No such file or directory
configure:4572: $? = 1
configure: failed program was:
| /* confdefs.h. */
|
| #define PACKAGE_NAME "ossie"
| #define PACKAGE_TARNAME "ossie"
| #define PACKAGE_VERSION "0.0.4-13JAN2006"
| #define PACKAGE_STRING "ossie 0.0.4-13JAN2006"
| #define PACKAGE_BUGREPORT ""
| #define PACKAGE "ossie"
| #define VERSION "0.0.4-13JAN2006"
| #ifdef __cplusplus
| extern "C" void std::exit (int) throw (); using std::exit;
| #endif
| /* end confdefs.h. */
| #include <ac_nonexistent.h>
configure:4616: checking for ANSI C header files
configure:4641: gcc -c -g -O2 conftest.c >&5
configure:4647: $? = 0
configure:4650: test -z || test ! -s conftest.err
configure:4653: $? = 0
configure:4656: test -s conftest.o
configure:4659: $? = 0
configure:4748: gcc -o conftest -g -O2 conftest.c >&5
conftest.c: In function 'main':
conftest.c:31: warning: incompatible implicit declaration of built-in function 'exit'
configure:4751: $? = 0
configure:4753: ./conftest
configure:4756: $? = 0
configure:4771: result: yes
configure:4795: checking for sys/types.h
configure:4811: gcc -c -g -O2 conftest.c >&5
configure:4817: $? = 0
configure:4820: test -z || test ! -s conftest.err
configure:4823: $? = 0
configure:4826: test -s conftest.o
configure:4829: $? = 0
configure:4840: result: yes
configure:4795: checking for sys/stat.h
configure:4811: gcc -c -g -O2 conftest.c >&5
configure:4817: $? = 0
configure:4820: test -z || test ! -s conftest.err
configure:4823: $? = 0
configure:4826: test -s conftest.o
configure:4829: $? = 0
configure:4840: result: yes
configure:4795: checking for stdlib.h
configure:4811: gcc -c -g -O2 conftest.c >&5
configure:4817: $? = 0
configure:4820: test -z || test ! -s conftest.err
configure:4823: $? = 0
configure:4826: test -s conftest.o
configure:4829: $? = 0
configure:4840: result: yes
configure:4795: checking for string.h
configure:4811: gcc -c -g -O2 conftest.c >&5
configure:4817: $? = 0
configure:4820: test -z || test ! -s conftest.err
configure:4823: $? = 0
configure:4826: test -s conftest.o
configure:4829: $? = 0
configure:4840: result: yes
configure:4795: checking for memory.h
configure:4811: gcc -c -g -O2 conftest.c >&5
configure:4817: $? = 0
configure:4820: test -z || test ! -s conftest.err
configure:4823: $? = 0
configure:4826: test -s conftest.o
configure:4829: $? = 0
configure:4840: result: yes
configure:4795: checking for strings.h
configure:4811: gcc -c -g -O2 conftest.c >&5
configure:4817: $? = 0
configure:4820: test -z || test ! -s conftest.err
configure:4823: $? = 0
configure:4826: test -s conftest.o
configure:4829: $? = 0
configure:4840: result: yes
configure:4795: checking for inttypes.h
configure:4811: gcc -c -g -O2 conftest.c >&5
configure:4817: $? = 0
configure:4820: test -z || test ! -s conftest.err
configure:4823: $? = 0
configure:4826: test -s conftest.o
configure:4829: $? = 0
configure:4840: result: yes
configure:4795: checking for stdint.h
configure:4811: gcc -c -g -O2 conftest.c >&5
configure:4817: $? = 0
configure:4820: test -z || test ! -s conftest.err
configure:4823: $? = 0
configure:4826: test -s conftest.o
configure:4829: $? = 0
configure:4840: result: yes
configure:4795: checking for unistd.h
configure:4811: gcc -c -g -O2 conftest.c >&5
configure:4817: $? = 0
configure:4820: test -z || test ! -s conftest.err
configure:4823: $? = 0
configure:4826: test -s conftest.o
configure:4829: $? = 0
configure:4840: result: yes
configure:4866: checking dlfcn.h usability
configure:4878: gcc -c -g -O2 conftest.c >&5
configure:4884: $? = 0
configure:4887: test -z || test ! -s conftest.err
configure:4890: $? = 0
configure:4893: test -s conftest.o
configure:4896: $? = 0
configure:4906: result: yes
configure:4910: checking dlfcn.h presence
configure:4920: gcc -E conftest.c
configure:4926: $? = 0
configure:4946: result: yes
configure:4981: checking for dlfcn.h
configure:4988: result: yes
configure:5006: checking how to run the C++ preprocessor
configure:5037: g++ -E conftest.cc
configure:5043: $? = 0
configure:5075: g++ -E conftest.cc
conftest.cc:25:28: error: ac_nonexistent.h: No such file or directory
configure:5081: $? = 1
configure: failed program was:
| /* confdefs.h. */
|
| #define PACKAGE_NAME "ossie"
| #define PACKAGE_TARNAME "ossie"
| #define PACKAGE_VERSION "0.0.4-13JAN2006"
| #define PACKAGE_STRING "ossie 0.0.4-13JAN2006"
| #define PACKAGE_BUGREPORT ""
| #define PACKAGE "ossie"
| #define VERSION "0.0.4-13JAN2006"
| #ifdef __cplusplus
| extern "C" void std::exit (int) throw (); using std::exit;
| #endif
| #define STDC_HEADERS 1
| #define HAVE_SYS_TYPES_H 1
| #define HAVE_SYS_STAT_H 1
| #define HAVE_STDLIB_H 1
| #define HAVE_STRING_H 1
| #define HAVE_MEMORY_H 1
| #define HAVE_STRINGS_H 1
| #define HAVE_INTTYPES_H 1
| #define HAVE_STDINT_H 1
| #define HAVE_UNISTD_H 1
| #define HAVE_DLFCN_H 1
| /* end confdefs.h. */
| #include <ac_nonexistent.h>
configure:5120: result: g++ -E
configure:5144: g++ -E conftest.cc
configure:5150: $? = 0
configure:5182: g++ -E conftest.cc
conftest.cc:25:28: error: ac_nonexistent.h: No such file or directory
configure:5188: $? = 1
configure: failed program was:
| /* confdefs.h. */
|
| #define PACKAGE_NAME "ossie"
| #define PACKAGE_TARNAME "ossie"
| #define PACKAGE_VERSION "0.0.4-13JAN2006"
| #define PACKAGE_STRING "ossie 0.0.4-13JAN2006"
| #define PACKAGE_BUGREPORT ""
| #define PACKAGE "ossie"
| #define VERSION "0.0.4-13JAN2006"
| #ifdef __cplusplus
| extern "C" void std::exit (int) throw (); using std::exit;
| #endif
| #define STDC_HEADERS 1
| #define HAVE_SYS_TYPES_H 1
| #define HAVE_SYS_STAT_H 1
| #define HAVE_STDLIB_H 1
| #define HAVE_STRING_H 1
| #define HAVE_MEMORY_H 1
| #define HAVE_STRINGS_H 1
| #define HAVE_INTTYPES_H 1
| #define HAVE_STDINT_H 1
| #define HAVE_UNISTD_H 1
| #define HAVE_DLFCN_H 1
| /* end confdefs.h. */
| #include <ac_nonexistent.h>
configure:5283: checking for g77
configure:5312: result: no
configure:5283: checking for f77
configure:5312: result: no
configure:5283: checking for xlf
configure:5312: result: no
configure:5283: checking for frt
configure:5312: result: no
configure:5283: checking for pgf77
configure:5312: result: no
configure:5283: checking for fort77
configure:5312: result: no
configure:5283: checking for fl32
configure:5312: result: no
configure:5283: checking for af77
configure:5312: result: no
configure:5283: checking for f90
configure:5312: result: no
configure:5283: checking for xlf90
configure:5312: result: no
configure:5283: checking for pgf90
configure:5312: result: no
configure:5283: checking for epcf90
configure:5312: result: no
configure:5283: checking for f95
configure:5312: result: no
configure:5283: checking for fort
configure:5312: result: no
configure:5283: checking for xlf95
configure:5312: result: no
configure:5283: checking for ifc
configure:5312: result: no
configure:5283: checking for efc
configure:5312: result: no
configure:5283: checking for pgf95
configure:5312: result: no
configure:5283: checking for lf95
configure:5312: result: no
configure:5283: checking for gfortran
configure:5312: result: no
configure:5324: checking for Fortran 77 compiler version
configure:5327: --version </dev/null >&5
./configure: line 5328: --version: command not found
configure:5330: $? = 127
configure:5332: -v </dev/null >&5
./configure: line 5333: -v: command not found
configure:5335: $? = 127
configure:5337: -V </dev/null >&5
./configure: line 5338: -V: command not found
configure:5340: $? = 127
configure:5348: checking whether we are using the GNU Fortran 77 compiler
configure:5362: -c conftest.F >&5
./configure: line 5363: -c: command not found
configure:5368: $? = 127
configure: failed program was:
| program main
| #ifndef __GNUC__
| choke me
| #endif
|
| end
configure:5393: result: no
configure:5399: checking whether accepts -g
configure:5411: -c -g conftest.f >&5
./configure: line 5412: -c: command not found
configure:5417: $? = 127
configure: failed program was:
| program main
|
| end
configure:5441: result: no
configure:5471: checking the maximum length of command line arguments
configure:5536: result: 32768
configure:5547: checking command to parse /usr/bin/nm -B output from gcc object
configure:5636: gcc -c -g -O2 conftest.c >&5
configure:5639: $? = 0
configure:5643: /usr/bin/nm -B conftest.o \| sed -n -e 's/^.*[ ]\([ABCDGIRSTW][ABCDGIRSTW]*\)[ ][ ]*\(\)\([_A-Za-z][_A-Za-z0-9]*\)$/\1 \2\3 \3/p' \> conftest.nm
configure:5646: $? = 0
configure:5698: gcc -o conftest -g -O2 conftest.c conftstm.o >&5
configure:5701: $? = 0
configure:5739: result: ok
configure:5743: checking for objdir
configure:5758: result: .libs
configure:5848: checking for ar
configure:5864: found /usr/bin/ar
configure:5875: result: ar
configure:5928: checking for ranlib
configure:5944: found /usr/bin/ranlib
configure:5955: result: ranlib
configure:6008: checking for strip
configure:6024: found /usr/bin/strip
configure:6035: result: strip
configure:6297: checking if gcc static flag works
configure:6320: result: yes
configure:6338: checking if gcc supports -fno-rtti -fno-exceptions
configure:6356: gcc -c -g -O2 -fno-rtti -fno-exceptions conftest.c >&5
cc1: warning: command line option "-fno-rtti" is valid for C++/ObjC++ but not for C
configure:6360: $? = 0
configure:6371: result: no
configure:6386: checking for gcc option to produce PIC
configure:6563: result: -fPIC
configure:6571: checking if gcc PIC flag -fPIC works
configure:6589: gcc -c -g -O2 -fPIC -DPIC conftest.c >&5
configure:6593: $? = 0
configure:6604: result: yes
configure:6628: checking if gcc supports -c -o file.o
configure:6649: gcc -c -g -O2 -o out/conftest2.o conftest.c >&5
configure:6653: $? = 0
configure:6673: result: yes
configure:6699: checking whether the gcc linker (/usr/bin/ld) supports shared libraries
configure:7546: result: yes
configure:7572: checking whether -lc should be explicitly linked in
configure:7577: gcc -c -g -O2 conftest.c >&5
configure:7580: $? = 0
configure:7594: gcc -shared conftest.o -v -Wl,-soname -Wl,conftest -o conftest 2\>\&1 \| grep -lc \>/dev/null 2\>\&1
configure:7597: $? = 0
configure:7609: result: no
configure:7617: checking dynamic linker characteristics
configure:8169: result: GNU/Linux ld.so
configure:8173: checking how to hardcode library paths into programs
configure:8198: result: immediate
configure:8212: checking whether stripping libraries is possible
configure:8217: result: yes
configure:9040: checking if libtool supports shared libraries
configure:9042: result: yes
configure:9045: checking whether to build shared libraries
configure:9103: result: yes
configure:9106: checking whether to build static libraries
configure:9110: result: yes
configure:9202: creating libtool
configure:9749: checking for ld used by g++
configure:9816: result: /usr/bin/ld
configure:9825: checking if the linker (/usr/bin/ld) is GNU ld
configure:9840: result: yes
configure:9891: checking whether the g++ linker (/usr/bin/ld) supports shared libraries
configure:10717: result: yes
configure:10735: g++ -c -g -O2 conftest.cc >&5
configure:10738: $? = 0
configure:10834: checking for g++ option to produce PIC
configure:11086: result: -fPIC
configure:11094: checking if g++ PIC flag -fPIC works
configure:11112: g++ -c -g -O2 -fPIC -DPIC conftest.cc >&5
configure:11116: $? = 0
configure:11127: result: yes
configure:11151: checking if g++ supports -c -o file.o
configure:11172: g++ -c -g -O2 -o out/conftest2.o conftest.cc >&5
configure:11176: $? = 0
configure:11196: result: yes
configure:11222: checking whether the g++ linker (/usr/bin/ld) supports shared libraries
configure:11250: result: yes
configure:11321: checking dynamic linker characteristics
configure:11873: result: GNU/Linux ld.so
configure:11877: checking how to hardcode library paths into programs
configure:11902: result: immediate
configure:11916: checking whether stripping libraries is possible
configure:11921: result: yes
configure:19182: checking for Xerces-C
configure:19215: g++ -o conftest -g -O2 conftest.cc -lxerces-c >&5
configure:19221: $? = 0
configure:19224: test -z || test ! -s conftest.err
configure:19227: $? = 0
configure:19230: test -s conftest
configure:19233: $? = 0
configure:19235: result: yes
configure:19260: checking for libraries containing socket functions
configure:19293: gcc -o conftest -g -O2 conftest.c -lxerces-c >&5
configure:19299: $? = 0
configure:19302: test -z || test ! -s conftest.err
configure:19305: $? = 0
configure:19308: test -s conftest
configure:19311: $? = 0
configure:19444: result: -lc
configure:19615: checking for the pthreads library -lpthreads
configure:19653: gcc -o conftest -g -O2 conftest.c -lpthreads -lxerces-c >&5
/usr/bin/ld: cannot find -lpthreads
collect2: ld returned 1 exit status
configure:19659: $? = 1
configure: failed program was:
| /* confdefs.h. */
|
| #define PACKAGE_NAME "ossie"
| #define PACKAGE_TARNAME "ossie"
| #define PACKAGE_VERSION "0.0.4-13JAN2006"
| #define PACKAGE_STRING "ossie 0.0.4-13JAN2006"
| #define PACKAGE_BUGREPORT ""
| #define PACKAGE "ossie"
| #define VERSION "0.0.4-13JAN2006"
| #ifdef __cplusplus
| extern "C" void std::exit (int) throw (); using std::exit;
| #endif
| #define STDC_HEADERS 1
| #define HAVE_SYS_TYPES_H 1
| #define HAVE_SYS_STAT_H 1
| #define HAVE_STDLIB_H 1
| #define HAVE_STRING_H 1
| #define HAVE_MEMORY_H 1
| #define HAVE_STRINGS_H 1
| #define HAVE_INTTYPES_H 1
| #define HAVE_STDINT_H 1
| #define HAVE_UNISTD_H 1
| #define HAVE_DLFCN_H 1
| /* end confdefs.h. */
| #include <pthread.h>
| int
| main ()
| {
| pthread_t th; pthread_join(th, 0);
| pthread_attr_init(0); pthread_cleanup_push(0, 0);
| pthread_create(0,0,0,0); pthread_cleanup_pop(0);
| ;
| return 0;
| }
configure:19685: result: no
configure:19604: checking whether pthreads work without any flags
configure:19653: gcc -o conftest -g -O2 conftest.c -lxerces-c >&5
configure:19659: $? = 0
configure:19662: test -z || test ! -s conftest.err
configure:19665: $? = 0
configure:19668: test -s conftest
configure:19671: $? = 0
configure:19685: result: yes
configure:19705: checking for joinable pthread attribute
configure:19723: gcc -o conftest -g -O2 conftest.c -lxerces-c >&5
configure:19729: $? = 0
configure:19732: test -z || test ! -s conftest.err
configure:19735: $? = 0
configure:19738: test -s conftest
configure:19741: $? = 0
configure:19806: result: PTHREAD_CREATE_JOINABLE
configure:19813: checking if more special flags are required for pthreads
configure:19820: result: no
configure:19832: checking for cc_r
configure:19859: result: gcc
configure:20018: checking for omniORB4
configure:20153: g++ -E conftest.cc
conftest.cc:36:28: error: omniORB4/CORBA.h: No such file or directory
configure:20159: $? = 1
configure: failed program was:
| /* confdefs.h. */
|
| #define PACKAGE_NAME "ossie"
| #define PACKAGE_TARNAME "ossie"
| #define PACKAGE_VERSION "0.0.4-13JAN2006"
| #define PACKAGE_STRING "ossie 0.0.4-13JAN2006"
| #define PACKAGE_BUGREPORT ""
| #define PACKAGE "ossie"
| #define VERSION "0.0.4-13JAN2006"
| #ifdef __cplusplus
| extern "C" void std::exit (int) throw (); using std::exit;
| #endif
| #define STDC_HEADERS 1
| #define HAVE_SYS_TYPES_H 1
| #define HAVE_SYS_STAT_H 1
| #define HAVE_STDLIB_H 1
| #define HAVE_STRING_H 1
| #define HAVE_MEMORY_H 1
| #define HAVE_STRINGS_H 1
| #define HAVE_INTTYPES_H 1
| #define HAVE_STDINT_H 1
| #define HAVE_UNISTD_H 1
| #define HAVE_DLFCN_H 1
| #define HAVE_PTHREAD 1
| #define __linux__ 1
| #define __OSVERSION__ 2
| #define __x86__ 1
| /* end confdefs.h. */
|
| /* The PACKAGE_* macros cause incompatabilities with omniORB4. */
| #undef PACKAGE_BUGREPORT
| #undef PACKAGE_NAME
| #undef PACKAGE_STRING
| #undef PACKAGE_TARNAME
| #undef PACKAGE_VERSION
| #include <omniORB4/CORBA.h>
|
configure:20355: result: no
configure:20481: checking for omniORB3
configure:20600: g++ -E conftest.cc
conftest.cc:29:28: error: omniORB3/CORBA.h: No such file or directory
configure:20606: $? = 1
configure: failed program was:
| /* confdefs.h. */
|
| #define PACKAGE_NAME "ossie"
| #define PACKAGE_TARNAME "ossie"
| #define PACKAGE_VERSION "0.0.4-13JAN2006"
| #define PACKAGE_STRING "ossie 0.0.4-13JAN2006"
| #define PACKAGE_BUGREPORT ""
| #define PACKAGE "ossie"
| #define VERSION "0.0.4-13JAN2006"
| #ifdef __cplusplus
| extern "C" void std::exit (int) throw (); using std::exit;
| #endif
| #define STDC_HEADERS 1
| #define HAVE_SYS_TYPES_H 1
| #define HAVE_SYS_STAT_H 1
| #define HAVE_STDLIB_H 1
| #define HAVE_STRING_H 1
| #define HAVE_MEMORY_H 1
| #define HAVE_STRINGS_H 1
| #define HAVE_INTTYPES_H 1
| #define HAVE_STDINT_H 1
| #define HAVE_UNISTD_H 1
| #define HAVE_DLFCN_H 1
| #define HAVE_PTHREAD 1
| #define __linux__ 1
| #define __OSVERSION__ 2
| #define __x86__ 1
| /* end confdefs.h. */
| #include <omniORB3/CORBA.h>
configure:20786: result: no
configure:20900: checking for sys/wait.h that is POSIX.1 compatible
configure:20931: gcc -c -g -O2 conftest.c >&5
configure:20937: $? = 0
configure:20940: test -z || test ! -s conftest.err
configure:20943: $? = 0
configure:20946: test -s conftest.o
configure:20949: $? = 0
configure:20960: result: yes
configure:20978: checking for dirent.h that defines DIR
configure:21002: gcc -c -g -O2 conftest.c >&5
configure:21008: $? = 0
configure:21011: test -z || test ! -s conftest.err
configure:21014: $? = 0
configure:21017: test -s conftest.o
configure:21020: $? = 0
configure:21031: result: yes
configure:21044: checking for library containing opendir
configure:21074: gcc -o conftest -g -O2 conftest.c -lxerces-c >&5
configure:21080: $? = 0
configure:21083: test -z || test ! -s conftest.err
configure:21086: $? = 0
configure:21089: test -s conftest
configure:21092: $? = 0
configure:21161: result: none required
configure:21296: checking for pid_t
configure:21320: gcc -c -g -O2 conftest.c >&5
configure:21326: $? = 0
configure:21329: test -z || test ! -s conftest.err
configure:21332: $? = 0
configure:21335: test -s conftest.o
configure:21338: $? = 0
configure:21349: result: yes
configure:21367: checking for unistd.h
configure:21372: result: yes
configure:21376: checking vfork.h usability
configure:21388: gcc -c -g -O2 conftest.c >&5
conftest.c:66:19: error: vfork.h: No such file or directory
configure:21394: $? = 1
configure: failed program was:
| /* confdefs.h. */
|
| #define PACKAGE_NAME "ossie"
| #define PACKAGE_TARNAME "ossie"
| #define PACKAGE_VERSION "0.0.4-13JAN2006"
| #define PACKAGE_STRING "ossie 0.0.4-13JAN2006"
| #define PACKAGE_BUGREPORT ""
| #define PACKAGE "ossie"
| #define VERSION "0.0.4-13JAN2006"
| #ifdef __cplusplus
| extern "C" void std::exit (int) throw (); using std::exit;
| #endif
| #define STDC_HEADERS 1
| #define HAVE_SYS_TYPES_H 1
| #define HAVE_SYS_STAT_H 1
| #define HAVE_STDLIB_H 1
| #define HAVE_STRING_H 1
| #define HAVE_MEMORY_H 1
| #define HAVE_STRINGS_H 1
| #define HAVE_INTTYPES_H 1
| #define HAVE_STDINT_H 1
| #define HAVE_UNISTD_H 1
| #define HAVE_DLFCN_H 1
| #define HAVE_PTHREAD 1
| #define __linux__ 1
| #define __OSVERSION__ 2
| #define __x86__ 1
| #define HAVE_SYS_WAIT_H 1
| #define HAVE_DIRENT_H 1
| #define HAVE_UNISTD_H 1
| /* end confdefs.h. */
| #include <stdio.h>
| #if HAVE_SYS_TYPES_H
| # include <sys/types.h>
| #endif
| #if HAVE_SYS_STAT_H
| # include <sys/stat.h>
| #endif
| #if STDC_HEADERS
| # include <stdlib.h>
| # include <stddef.h>
| #else
| # if HAVE_STDLIB_H
| # include <stdlib.h>
| # endif
| #endif
| #if HAVE_STRING_H
| # if !STDC_HEADERS && HAVE_MEMORY_H
| # include <memory.h>
| # endif
| # include <string.h>
| #endif
| #if HAVE_STRINGS_H
| # include <strings.h>
| #endif
| #if HAVE_INTTYPES_H
| # include <inttypes.h>
| #else
| # if HAVE_STDINT_H
| # include <stdint.h>
| # endif
| #endif
| #if HAVE_UNISTD_H
| # include <unistd.h>
| #endif
| #include <vfork.h>
configure:21416: result: no
configure:21420: checking vfork.h presence
configure:21430: gcc -E conftest.c
conftest.c:32:19: error: vfork.h: No such file or directory
configure:21436: $? = 1
configure: failed program was:
| /* confdefs.h. */
|
| #define PACKAGE_NAME "ossie"
| #define PACKAGE_TARNAME "ossie"
| #define PACKAGE_VERSION "0.0.4-13JAN2006"
| #define PACKAGE_STRING "ossie 0.0.4-13JAN2006"
| #define PACKAGE_BUGREPORT ""
| #define PACKAGE "ossie"
| #define VERSION "0.0.4-13JAN2006"
| #ifdef __cplusplus
| extern "C" void std::exit (int) throw (); using std::exit;
| #endif
| #define STDC_HEADERS 1
| #define HAVE_SYS_TYPES_H 1
| #define HAVE_SYS_STAT_H 1
| #define HAVE_STDLIB_H 1
| #define HAVE_STRING_H 1
| #define HAVE_MEMORY_H 1
| #define HAVE_STRINGS_H 1
| #define HAVE_INTTYPES_H 1
| #define HAVE_STDINT_H 1
| #define HAVE_UNISTD_H 1
| #define HAVE_DLFCN_H 1
| #define HAVE_PTHREAD 1
| #define __linux__ 1
| #define __OSVERSION__ 2
| #define __x86__ 1
| #define HAVE_SYS_WAIT_H 1
| #define HAVE_DIRENT_H 1
| #define HAVE_UNISTD_H 1
| /* end confdefs.h. */
| #include <vfork.h>
configure:21456: result: no
configure:21491: checking for vfork.h
configure:21498: result: no
configure:21516: checking for fork
configure:21573: gcc -o conftest -g -O2 conftest.c -lxerces-c >&5
conftest.c:56: warning: conflicting types for built-in function 'fork'
configure:21579: $? = 0
configure:21582: test -z || test ! -s conftest.err
configure:21585: $? = 0
configure:21588: test -s conftest
configure:21591: $? = 0
configure:21603: result: yes
configure:21516: checking for vfork
configure:21573: gcc -o conftest -g -O2 conftest.c -lxerces-c >&5
configure:21579: $? = 0
configure:21582: test -z || test ! -s conftest.err
configure:21585: $? = 0
configure:21588: test -s conftest
configure:21591: $? = 0
configure:21603: result: yes
configure:21614: checking for working fork
configure:21637: gcc -o conftest -g -O2 conftest.c -lxerces-c >&5
conftest.c: In function 'main':
conftest.c:10: warning: incompatible implicit declaration of built-in function 'exit'
configure:21640: $? = 0
configure:21642: ./conftest
configure:21645: $? = 0
configure:21659: result: yes
configure:21680: checking for working vfork
configure:21813: result: yes
configure:21994: creating ./config.status
## ---------------------- ##
## Running config.status. ##
## ---------------------- ##
This file was extended by ossie config.status 0.0.4-13JAN2006, which was
generated by GNU Autoconf 2.59. Invocation command line was
CONFIG_FILES =
CONFIG_HEADERS =
CONFIG_LINKS =
CONFIG_COMMANDS =
$ ./config.status
on ubuntu-jsimone
config.status:763: creating Makefile
config.status:763: creating ossie.pc
config.status:763: creating idl/Makefile
config.status:763: creating parser/Makefile
config.status:763: creating framework/Makefile
config.status:763: creating include/Makefile
config.status:763: creating include/ossie/Makefile
config.status:908: executing depfiles commands
## ---------------- ##
## Cache variables. ##
## ---------------- ##
ac_cv_build=i686-pc-linux-gnu
ac_cv_build_alias=i686-pc-linux-gnu
ac_cv_c_compiler_gnu=yes
ac_cv_corba_omniorb3=no
ac_cv_corba_omniorb4=no
ac_cv_cxx_compiler_gnu=yes
ac_cv_env_CC_set=
ac_cv_env_CC_value=
ac_cv_env_CFLAGS_set=
ac_cv_env_CFLAGS_value=
ac_cv_env_CPPFLAGS_set=
ac_cv_env_CPPFLAGS_value=
ac_cv_env_CPP_set=
ac_cv_env_CPP_value=
ac_cv_env_CXXCPP_set=
ac_cv_env_CXXCPP_value=
ac_cv_env_CXXFLAGS_set=
ac_cv_env_CXXFLAGS_value=
ac_cv_env_CXX_set=
ac_cv_env_CXX_value=
ac_cv_env_F77_set=
ac_cv_env_F77_value=
ac_cv_env_FFLAGS_set=
ac_cv_env_FFLAGS_value=
ac_cv_env_LDFLAGS_set=
ac_cv_env_LDFLAGS_value=
ac_cv_env_build_alias_set=
ac_cv_env_build_alias_value=
ac_cv_env_host_alias_set=
ac_cv_env_host_alias_value=
ac_cv_env_target_alias_set=
ac_cv_env_target_alias_value=
ac_cv_exeext=
ac_cv_f77_compiler_gnu=no
ac_cv_func_fork=yes
ac_cv_func_fork_works=yes
ac_cv_func_vfork=yes
ac_cv_func_vfork_works=yes
ac_cv_header_dirent_dirent_h=yes
ac_cv_header_dlfcn_h=yes
ac_cv_header_inttypes_h=yes
ac_cv_header_memory_h=yes
ac_cv_header_stdc=yes
ac_cv_header_stdint_h=yes
ac_cv_header_stdlib_h=yes
ac_cv_header_string_h=yes
ac_cv_header_strings_h=yes
ac_cv_header_sys_stat_h=yes
ac_cv_header_sys_types_h=yes
ac_cv_header_sys_wait_h=yes
ac_cv_header_unistd_h=yes
ac_cv_header_vfork_h=no
ac_cv_host=i686-pc-linux-gnu
ac_cv_host_alias=i686-pc-linux-gnu
ac_cv_objext=o
ac_cv_path_install='/usr/bin/install -c'
ac_cv_prog_AWK=gawk
ac_cv_prog_CPP='gcc -E'
ac_cv_prog_CXXCPP='g++ -E'
ac_cv_prog_PTHREAD_CC=gcc
ac_cv_prog_ac_ct_AR=ar
ac_cv_prog_ac_ct_CC=gcc
ac_cv_prog_ac_ct_CXX=g++
ac_cv_prog_ac_ct_RANLIB=ranlib
ac_cv_prog_ac_ct_STRIP=strip
ac_cv_prog_cc_g=yes
ac_cv_prog_cc_stdc=
ac_cv_prog_cxx_g=yes
ac_cv_prog_egrep='grep -E'
ac_cv_prog_f77_g=no
ac_cv_prog_make_make_set=yes
ac_cv_search_opendir='none required'
ac_cv_socket_libs=-lc
ac_cv_type_pid_t=yes
am_cv_CC_dependencies_compiler_type=gcc3
am_cv_CXX_dependencies_compiler_type=gcc3
lt_cv_deplibs_check_method=pass_all
lt_cv_file_magic_cmd='$MAGIC_CMD'
lt_cv_file_magic_test_file=
lt_cv_ld_reload_flag=-r
lt_cv_objdir=.libs
lt_cv_path_LD=/usr/bin/ld
lt_cv_path_LDCXX=/usr/bin/ld
lt_cv_path_NM='/usr/bin/nm -B'
lt_cv_path_SED=/bin/sed
lt_cv_prog_compiler_c_o=yes
lt_cv_prog_compiler_c_o_CXX=yes
lt_cv_prog_compiler_rtti_exceptions=no
lt_cv_prog_gnu_ld=yes
lt_cv_prog_gnu_ldcxx=yes
lt_cv_sys_global_symbol_pipe='sed -n -e '\''s/^.*[ ]\([ABCDGIRSTW][ABCDGIRSTW]*\)[ ][ ]*\(\)\([_A-Za-z][_A-Za-z0-9]*\)$/\1 \2\3 \3/p'\'''
lt_cv_sys_global_symbol_to_c_name_address='sed -n -e '\''s/^: \([^ ]*\) $/ {\"\1\", (lt_ptr) 0},/p'\'' -e '\''s/^[BCDEGRST] \([^ ]*\) \([^ ]*\)$/ {"\2", (lt_ptr) \&\2},/p'\'''
lt_cv_sys_global_symbol_to_cdecl='sed -n -e '\''s/^. .* \(.*\)$/extern int \1;/p'\'''
lt_cv_sys_max_cmd_len=32768
lt_lt_cv_prog_compiler_c_o='"yes"'
lt_lt_cv_prog_compiler_c_o_CXX='"yes"'
lt_lt_cv_sys_global_symbol_pipe='"sed -n -e '\''s/^.*[ ]\\([ABCDGIRSTW][ABCDGIRSTW]*\\)[ ][ ]*\\(\\)\\([_A-Za-z][_A-Za-z0-9]*\\)\$/\\1 \\2\\3 \\3/p'\''"'
lt_lt_cv_sys_global_symbol_to_c_name_address='"sed -n -e '\''s/^: \\([^ ]*\\) \$/ {\\\"\\1\\\", (lt_ptr) 0},/p'\'' -e '\''s/^[BCDEGRST] \\([^ ]*\\) \\([^ ]*\\)\$/ {\"\\2\", (lt_ptr) \\&\\2},/p'\''"'
lt_lt_cv_sys_global_symbol_to_cdecl='"sed -n -e '\''s/^. .* \\(.*\\)\$/extern int \\1;/p'\''"'
## ----------------- ##
## Output variables. ##
## ----------------- ##
ACLOCAL='${SHELL} /home/vrose/src/ossie/missing --run aclocal-1.9'
AMDEPBACKSLASH='\'
AMDEP_FALSE='#'
AMDEP_TRUE=''
AMTAR='${SHELL} /home/vrose/src/ossie/missing --run tar'
AR='ar'
AUTOCONF='${SHELL} /home/vrose/src/ossie/missing --run autoconf'
AUTOHEADER='${SHELL} /home/vrose/src/ossie/missing --run autoheader'
AUTOMAKE='${SHELL} /home/vrose/src/ossie/missing --run automake-1.9'
AWK='gawk'
CC='gcc'
CCDEPMODE='depmode=gcc3'
CFLAGS='-g -O2'
CORBA_ORB=''
CPP='gcc -E'
CPPFLAGS=''
CXX='g++'
CXXCPP='g++ -E'
CXXDEPMODE='depmode=gcc3'
CXXFLAGS='-g -O2'
CYGPATH_W='echo'
DEFS='-DPACKAGE_NAME=\"ossie\" -DPACKAGE_TARNAME=\"ossie\" -DPACKAGE_VERSION=\"0.0.4-13JAN2006\" -DPACKAGE_STRING=\"ossie\ 0.0.4-13JAN2006\" -DPACKAGE_BUGREPORT=\"\" -DPACKAGE=\"ossie\" -DVERSION=\"0.0.4-13JAN2006\" -DSTDC_HEADERS=1 -DHAVE_SYS_TYPES_H=1 -DHAVE_SYS_STAT_H=1 -DHAVE_STDLIB_H=1 -DHAVE_STRING_H=1 -DHAVE_MEMORY_H=1 -DHAVE_STRINGS_H=1 -DHAVE_INTTYPES_H=1 -DHAVE_STDINT_H=1 -DHAVE_UNISTD_H=1 -DHAVE_DLFCN_H=1 -DHAVE_PTHREAD=1 -D__linux__=1 -D__OSVERSION__=2 -D__x86__=1 -DHAVE_SYS_WAIT_H=1 -DHAVE_DIRENT_H=1 -DHAVE_UNISTD_H=1 -DHAVE_FORK=1 -DHAVE_VFORK=1 -DHAVE_WORKING_VFORK=1 -DHAVE_WORKING_FORK=1 '
DEPDIR='.deps'
ECHO='echo'
ECHO_C=''
ECHO_N='-n'
ECHO_T=''
EGREP='grep -E'
ETR_SOCKET_LIBS=''
EXEEXT=''
F77=''
FFLAGS=''
IDL=''
IDL_CPPFLAGS=''
INSTALL_DATA='${INSTALL} -m 644'
INSTALL_PROGRAM='${INSTALL}'
INSTALL_SCRIPT='${INSTALL}'
INSTALL_STRIP_PROGRAM='${SHELL} $(install_sh) -c -s'
LDFLAGS=''
LIBOBJS=''
LIBS='-lxerces-c '
LIBTOOL='$(SHELL) $(top_builddir)/libtool'
LN_S='ln -s'
LTLIBOBJS=''
MAKEINFO='${SHELL} /home/vrose/src/ossie/missing --run makeinfo'
OBJEXT='o'
OSVERSION='2'
PACKAGE='ossie'
PACKAGE_BUGREPORT=''
PACKAGE_NAME='ossie'
PACKAGE_STRING='ossie 0.0.4-13JAN2006'
PACKAGE_TARNAME='ossie'
PACKAGE_VERSION='0.0.4-13JAN2006'
PATH_SEPARATOR=':'
PLATFORM_DEFINITION='__linux__'
PLATFORM_NAME='Linux'
PROCESSOR_DEFINITION='__x86__'
PROCESSOR_NAME='x86Processor'
PTHREAD_CC='gcc'
PTHREAD_CFLAGS=''
PTHREAD_LIBS=''
RANLIB='ranlib'
SET_MAKE=''
SHELL='/bin/sh'
STRIP='strip'
VERSION='0.0.4-13JAN2006'
ac_ct_AR='ar'
ac_ct_CC='gcc'
ac_ct_CXX='g++'
ac_ct_F77=''
ac_ct_RANLIB='ranlib'
ac_ct_STRIP='strip'
am__fastdepCC_FALSE='#'
am__fastdepCC_TRUE=''
am__fastdepCXX_FALSE='#'
am__fastdepCXX_TRUE=''
am__include='include'
am__leading_dot='.'
am__quote=''
am__tar='${AMTAR} chof - "$$tardir"'
am__untar='${AMTAR} xf -'
bindir='${exec_prefix}/bin'
build='i686-pc-linux-gnu'
build_alias=''
build_cpu='i686'
build_os='linux-gnu'
build_vendor='pc'
datadir='${prefix}/share'
exec_prefix='${prefix}'
host='i686-pc-linux-gnu'
host_alias=''
host_cpu='i686'
host_os='linux-gnu'
host_vendor='pc'
includedir='${prefix}/include'
infodir='${prefix}/info'
install_sh='/home/vrose/src/ossie/install-sh'
libdir='${exec_prefix}/lib'
libexecdir='${exec_prefix}/libexec'
localstatedir='${prefix}/var'
mandir='${prefix}/man'
mkdir_p='mkdir -p --'
oldincludedir='/usr/include'
prefix='/usr/local'
program_transform_name='s,x,x,'
sbindir='${exec_prefix}/sbin'
sharedstatedir='${prefix}/com'
sysconfdir='${prefix}/etc'
target_alias=''
## ----------- ##
## confdefs.h. ##
## ----------- ##
#define HAVE_DIRENT_H 1
#define HAVE_DLFCN_H 1
#define HAVE_FORK 1
#define HAVE_INTTYPES_H 1
#define HAVE_MEMORY_H 1
#define HAVE_PTHREAD 1
#define HAVE_STDINT_H 1
#define HAVE_STDLIB_H 1
#define HAVE_STRINGS_H 1
#define HAVE_STRING_H 1
#define HAVE_SYS_STAT_H 1
#define HAVE_SYS_TYPES_H 1
#define HAVE_SYS_WAIT_H 1
#define HAVE_UNISTD_H 1
#define HAVE_UNISTD_H 1
#define HAVE_VFORK 1
#define HAVE_WORKING_FORK 1
#define HAVE_WORKING_VFORK 1
#define PACKAGE "ossie"
#define PACKAGE_BUGREPORT ""
#define PACKAGE_NAME "ossie"
#define PACKAGE_STRING "ossie 0.0.4-13JAN2006"
#define PACKAGE_TARNAME "ossie"
#define PACKAGE_VERSION "0.0.4-13JAN2006"
#define STDC_HEADERS 1
#define VERSION "0.0.4-13JAN2006"
#define __OSVERSION__ 2
#define __linux__ 1
#define __x86__ 1
#endif
#ifdef __cplusplus
extern "C" void std::exit (int) throw (); using std::exit;
configure: exit 0