rendered paste body/usr/bin/install -c -m 644 C/figures/vfolder-createrule-fig.png /usr/local/share/gnome/help/evolution/es/figures/vfolder-createrule-fig.png
/usr/bin/install -c -m 644 C/figures/vfolder-createrule-fig.png /usr/local/share/gnome/help/evolution/sv/figures/vfolder-createrule-fig.png
/bin/sh ../mkinstalldirs /usr/local/share/omf/evolution
/usr/bin/install -c -m 644 evolution-C.omf /usr/local/share/omf/evolution/evolution-C.omf
/usr/bin/install -c -m 644 evolution-en_GB.omf /usr/local/share/omf/evolution/evolution-en_GB.omf
/usr/bin/install -c -m 644 evolution-es.omf /usr/local/share/omf/evolution/evolution-es.omf
/usr/bin/install -c -m 644 evolution-sv.omf /usr/local/share/omf/evolution/evolution-sv.omf
scrollkeeper-update -p /var/lib/scrollkeeper -o /usr/local/share/omf/evolution
/bin/sh: line 3: 5219 Segmentation fault scrollkeeper-update -p "`scrollkeeper-config --pkglocalstatedir`" -o "/usr/local/share/omf/evolution"
make[3]: *** [install-doc-omf] Error 139
make[3]: Leaving directory `/home/sheethal/cvs/gnome/evolution/help'
make[2]: *** [install-am] Error 2
make[2]: Leaving directory `/home/sheethal/cvs/gnome/evolution/help'
make[1]: *** [install-recursive] Error 1
make[1]: Leaving directory `/home/sheethal/cvs/gnome/evolution/help'
make: *** [install-recursive] Error 1
sheethal:/home/sheethal/cvs/gnome/evolution #