!!! ERROR: x11-drivers/xf86-input-evdev-1.1.2-r2 failed.
Call stack:
ebuild.sh, line 1614: Called dyn_compile
ebuild.sh, line 971: Called qa_call 'src_compile'
environment, line 3830: Called src_compile
ebuild.sh, line 1304: Called x-modular_src_compile
x-modular.eclass, line 333: Called x-modular_src_make
x-modular.eclass, line 328: Called die
evdev.c: In function 'EvdevSwitchMode':
evdev.c:235: error: 'SendCoreEvents' undeclared (first use in this function)
evdev.c:235: error: (Each undeclared identifier is reported only once
evdev.c:235: error: for each function it appears in.)
evdev.c:236: error: 'DontSendCoreEvents' undeclared (first use in this function)
make[2]: *** [evdev_drv_la-evdev.lo] Error 1
make[2]: *** Waiting for unfinished jobs....
make[1]: *** [all-recursive] Error 1
make: *** [all] Error 2