All pastes #415636 Raw Edit

Unnamed

public php v1 · immutable
#415636 ·published 2007-03-29 19:33 UTC
rendered paste body
config.status: creating php5.specconfig.status: creating main/build-defs.hconfig.status: creating scripts/phpizeconfig.status: creating scripts/man1/phpize.1config.status: creating scripts/php-configconfig.status: creating scripts/man1/php-config.1config.status: creating sapi/cli/php.1config.status: creating main/php_config.hconfig.status: executing default commands/var/tmp/portage/dev-lang/php-5.1.6-r11/work/php-5.1.6/ext/openssl/openssl.c: In function 'php_openssl_x509_from_zval':/var/tmp/portage/dev-lang/php-5.1.6-r11/work/php-5.1.6/ext/openssl/openssl.c:776: warning: passing argument 1 of 'PEM_ASN1_read_bio' from incompatible pointer type/var/tmp/portage/dev-lang/php-5.1.6-r11/work/php-5.1.6/ext/date/lib/tm2unixtime.c: In function 'do_years':/var/tmp/portage/dev-lang/php-5.1.6-r11/work/php-5.1.6/ext/date/lib/tm2unixtime.c:143: warning: integer constant is too large for 'long' type/var/tmp/portage/dev-lang/php-5.1.6-r11/work/php-5.1.6/ext/dba/dba_db4.c: In function 'dba_open_db4':/var/tmp/portage/dev-lang/php-5.1.6-r11/work/php-5.1.6/ext/dba/dba_db4.c:99: warning: passing argument 2 of 'dbp->set_errcall' from incompatible pointer type/var/tmp/portage/dev-lang/php-5.1.6-r11/work/php-5.1.6/ext/mbstring/mbstring.c:151: warning: initialization discards qualifiers from pointer target type/var/tmp/portage/dev-lang/php-5.1.6-r11/work/php-5.1.6/ext/mbstring/mbstring.c:152: warning: initialization discards qualifiers from pointer target type/var/tmp/portage/dev-lang/php-5.1.6-r11/work/php-5.1.6/ext/mbstring/mbstring.c:153: warning: initialization discards qualifiers from pointer target type/var/tmp/portage/dev-lang/php-5.1.6-r11/work/php-5.1.6/ext/mbstring/mbstring.c:154: warning: initialization discards qualifiers from pointer target type/var/tmp/portage/dev-lang/php-5.1.6-r11/work/php-5.1.6/ext/mbstring/mbstring.c:155: warning: initialization discards qualifiers from pointer target type/var/tmp/portage/dev-lang/php-5.1.6-r11/work/php-5.1.6/ext/mbstring/mbstring.c:156: warning: initialization discards qualifiers from pointer target type/var/tmp/portage/dev-lang/php-5.1.6-r11/work/php-5.1.6/ext/mbstring/mbstring.c:157: warning: initialization discards qualifiers from pointer target type/var/tmp/portage/dev-lang/php-5.1.6-r11/work/php-5.1.6/ext/mbstring/mbstring.c:158: warning: initialization discards qualifiers from pointer target type/var/tmp/portage/dev-lang/php-5.1.6-r11/work/php-5.1.6/ext/pgsql/pgsql.c: In function 'php_pgsql_get_link_info':/var/tmp/portage/dev-lang/php-5.1.6-r11/work/php-5.1.6/ext/pgsql/pgsql.c:938: error: 'PG_VERSION' undeclared (first use in this function)/var/tmp/portage/dev-lang/php-5.1.6-r11/work/php-5.1.6/ext/pgsql/pgsql.c:938: error: (Each undeclared identifier is reported only once/var/tmp/portage/dev-lang/php-5.1.6-r11/work/php-5.1.6/ext/pgsql/pgsql.c:938: error: for each function it appears in.)make: *** [ext/pgsql/pgsql.lo] Error 1make: *** Waiting for unfinished jobs....!!! ERROR: dev-lang/php-5.1.6-r11 failed.Call stack:  ebuild.sh, line 1614:   Called dyn_compile  ebuild.sh, line 971:   Called qa_call 'src_compile'  environment, line 5204:   Called src_compile  php-5.1.6-r11.ebuild, line 173:   Called src_compile_normal  php-5.1.6-r11.ebuild, line 323:   Called php5_1-sapi_src_compile  php5_1-sapi.eclass, line 606:   Called die!!! make failed!!! If you need support, post the topmost build error, and the call stack if relevant.!!! A complete build log is located at '/var/tmp/portage/dev-lang/php-5.1.6-r11/temp/build.log'.