codec_zap.c: In function find_transcoders:
codec_zap.c:849: error: variable info has initializer but incomplete type
codec_zap.c:849: warning: excess elements in struct initializer
codec_zap.c:849: warning: (near initialization for info)
codec_zap.c:849: error: storage size of info isnt known
codec_zap.c:854: error: ZT_TCOP_GETINFO undeclared (first use in this function)
codec_zap.c:864: error: ZT_TRANSCODE_OP undeclared (first use in this function)
codec_zap.c:849: warning: unused variable info
make[1]: *** [codec_zap.o] Erreur 1
make[1]: quittant le répertoire « /home/aster/download/asterisk-1.2.17/codecs »
make: *** [subdirs] Erreur 1
backup:/home/aster/download/asterisk-1.2.17#