All pastes #412721 Raw Edit

Untitled

public text v1 · immutable
#412721 ·published 2007-03-27 22:11 UTC
rendered paste body
dan@osafound-efy68w ~/fullchandler/wx/trunk
$ make DEBUG=1
cd /home/dan/fullchandler/wx/trunk; \
        sed -e "s/#define wxUSE_UNICODE *0/#define wxUSE_UNICODE 1/" include/wx/msw/setup0.h | \
        sed -e "s/#define wxUSE_DIALUP_MANAGER *1/#define wxUSE_DIALUP_MANAGER 0/" | \
        sed -e "s/#define wxUSE_DISPLAY *0/#define wxUSE_DISPLAY 1/" | \
        sed -e "s/#define wxUSE_RESOURCES *0/#define wxUSE_RESOURCES 1/" | \
        sed -e "s/#define wxUSE_DIB_FOR_BITMAP *0/#define wxUSE_DIB_FOR_BITMAP 1/" | \
        sed -e "s/#define wxUSE_GRAPHICS_CONTEXT *0/#define wxUSE_GRAPHICS_CONTEXT 1/" | \
        sed -e "s/#define wxUSE_POSTSCRIPT *0/#define wxUSE_POSTSCRIPT 1/"> include/wx/msw/setup.h
cd /home/dan/fullchandler/wx/trunk; \
                export WXWIN=`cygpath -aw /home/dan/fullchandler/wx/trunk`; MAKEFLAGS=; \
                devenv.com build/msw/wx_osaf.sln /build 'DLL Unicode Debug'

Microsoft (R) Development Environment  Version 7.10.6030.
Copyright (C) Microsoft Corp 1984-2001. All rights reserved.
------ Build started: Project: wxregex, Configuration: DLL Unicode Debug Win32 ------

Creating ..\..\lib\vc_dll\mswud\wx\setup.h
        1 file(s) copied.
Compiling...
regfree.c
regexec.c
regerror.c
regcomp.c
Generating Code...
Creating library...

Build log was saved at "file://c:\cygwin\home\dan\fullchandler\wx\trunk\build\msw\vc_mswuddll\wxregex\BuildLog.htm"
wxregex - 0 error(s), 0 warning(s)


------ Build started: Project: wxzlib, Configuration: DLL Unicode Debug Win32 ------




------ Build started: Project: wxpng, Configuration: DLL Unicode Debug Win32 ------




------ Build started: Project: wxjpeg, Configuration: DLL Unicode Debug Win32 ------




------ Build started: Project: wxtiff, Configuration: DLL Unicode Debug Win32 ------




------ Build started: Project: wxexpat, Configuration: DLL Unicode Debug Win32 ------




------ Build started: Project: base, Configuration: DLL Unicode Debug Win32 ------

Compiling...
dummy.cpp
Compiling...
volume.cpp
utilsexc.cpp
utils.cpp
thread.cpp
stdpaths.cpp
stackwalk.cpp
snglinst.cpp
registry.cpp
regconf.cpp
power.cpp
mslu.cpp
mimetype.cpp
main.cpp
dlmsw.cpp
dir.cpp
debughlp.cpp
dde.cpp
crashrpt.cpp
basemsw.cpp
zstream.cpp
Generating Code...
Compiling...
zipstrm.cpp
xtistrm.cpp
xti.cpp
wxchar.cpp
wfstream.cpp
variant.cpp
utilscmn.cpp
uri.cpp
txtstrm.cpp
tokenzr.cpp
textfile.cpp
textbuf.cpp
tarstrm.cpp
sysopt.cpp
string.cpp
stream.cpp
strconv.cpp
stopwatch.cpp
stdpbase.cpp
sstream.cpp
Generating Code...
Compiling...
regex.cpp
process.cpp
powercmn.cpp
platinfo.cpp
object.cpp
mstream.cpp
msgout.cpp
module.cpp
mimecmn.cpp
memory.cpp
longlong.cpp
log.cpp
list.cpp
ipcbase.cpp
intl.cpp
init.cpp
hashmap.cpp
hash.cpp
fs_mem.cpp
fs_filter.cpp
Generating Code...
Compiling...
fs_arc.cpp
fmapbase.cpp
filtfind.cpp
filtall.cpp
filesys.cpp
filename.cpp
filefn.cpp
fileconf.cpp
fileback.cpp
file.cpp
ffile.cpp
event.cpp
encconv.cpp
dynload.cpp
dynlib.cpp
dynarray.cpp
dircmn.cpp
datstrm.cpp
datetime.cpp
convauto.cpp
Generating Code...
Compiling...
config.cpp
cmdline.cpp
clntdata.cpp
archive.cpp
arcfind.cpp
arcall.cpp
appbase.cpp
Generating Code...
Compiling...
extended.c
Compiling resources...
Linking...
   Creating library ..\..\lib\vc_dll\wxbase28ud.lib and object ..\..\lib\vc_dll\wxbase28ud.exp

Build log was saved at "file://c:\cygwin\home\dan\fullchandler\wx\trunk\build\msw\vc_mswuddll\base\BuildLog.htm"
base - 0 error(s), 0 warning(s)


------ Build started: Project: net, Configuration: DLL Unicode Debug Win32 ------

Compiling...
dummy.cpp
Compiling...
urlmsw.cpp
gsocket.cpp
url.cpp
socket.cpp
sckstrm.cpp
sckipc.cpp
sckfile.cpp
sckaddr.cpp
protocol.cpp
http.cpp
ftp.cpp
fs_inet.cpp
Generating Code...
Compiling resources...
Linking...
   Creating library ..\..\lib\vc_dll\wxbase28ud_net.lib and object ..\..\lib\vc_dll\wxbase28ud_net.exp

Build log was saved at "file://c:\cygwin\home\dan\fullchandler\wx\trunk\build\msw\vc_mswuddll\net\BuildLog.htm"
net - 0 error(s), 0 warning(s)


------ Build started: Project: core, Configuration: DLL Unicode Debug Win32 ------

Compiling...
dummy.cpp
Compiling...
vscroll.cpp
vlbox.cpp
treectlg.cpp
treebkg.cpp
toolbkg.cpp
tipwin.cpp
textdlgg.cpp
statusbr.cpp
srchctlg.cpp
splitter.cpp
spinctlg.cpp
selstore.cpp
scrlwing.cpp
renderg.cpp
progdlgg.cpp
prntdlgg.cpp
printps.cpp
panelg.cpp
numdlgg.cpp
logg.cpp
Generating Code...
Compiling...
listbkg.cpp
fontpickerg.cpp
filepickerg.cpp
dragimgg.cpp
dirctrlg.cpp
dcpsg.cpp
combog.cpp
collpaneg.cpp
clrpickerg.cpp
choicdgg.cpp
choicbkg.cpp
buttonbar.cpp
busyinfo.cpp
window.cpp
volume.cpp
uxtheme.cpp
uuid.cpp
utilsgui.cpp
treectrl.cpp
toplevel.cpp
Generating Code...
Compiling...
tooltip.cpp
timer.cpp
tglbtn.cpp
textctrl.cpp
tbar95.cpp
\cygwin\home\dan\fullchandler\wx\trunk\src\msw\tbar95.cpp(1658) : warning C4100: 'height' : unreferenced formal parameter
\cygwin\home\dan\fullchandler\wx\trunk\src\msw\tbar95.cpp(1658) : warning C4100: 'width' : unreferenced formal parameter
tabctrl.cpp
stattext.cpp
statline.cpp
statbr95.cpp
statbox.cpp
statbmp.cpp
spinctrl.cpp
spinbutt.cpp
slider95.cpp
settings.cpp
scrolbar.cpp
renderer.cpp
region.cpp
radiobut.cpp
radiobox.cpp
Generating Code...
Compiling...
printwin.cpp
printdlg.cpp
popupwin.cpp
pen.cpp
palette.cpp
ownerdrw.cpp
oleutils.cpp
notebook.cpp
nativdlg.cpp
mslu.cpp
msgdlg.cpp
minifram.cpp
metafile.cpp
menuitem.cpp
menu.cpp
mdi.cpp
main.cpp
listctrl.cpp
listbox.cpp
iniconf.cpp
Generating Code...
Compiling...
imaglist.cpp
icon.cpp
helpwin.cpp
helpchm.cpp
gsockmsw.cpp
graphics.cpp
\cygwin\home\dan\fullchandler\wx\trunk\src\msw\graphics.cpp(329) : warning C4251: 'wxGDIPlusContext::m_stateStack' : class 'std::v
ector<_Ty>' needs to have dll-interface to be used by clients of class 'wxGDIPlusContext'
        with
        [
            _Ty=Gdiplus::GraphicsState
        ]
gdiobj.cpp
gdiimage.cpp
gauge95.cpp
frame.cpp
fontutil.cpp
fontenum.cpp
fontdlg.cpp
font.cpp
filedlg.cpp
fdrepdlg.cpp
evtloop.cpp
enhmeta.cpp
droptgt.cpp
dropsrc.cpp
Generating Code...
Compiling...
dragimag.cpp
display.cpp
dirdlg.cpp
dib.cpp
dialup.cpp
dialog.cpp
dcscreen.cpp
dcprint.cpp
dcmemory.cpp
dcclient.cpp
dc.cpp
dataobj.cpp
data.cpp
cursor.cpp
control.cpp
combobox.cpp
combo.cpp
colour.cpp
colordlg.cpp
clipbrd.cpp
Generating Code...
Compiling...
choice.cpp
checklst.cpp
checkbox.cpp
caret.cpp
button.cpp
brush.cpp
bmpbuttn.cpp
bitmap.cpp
automtn.cpp
app.cpp
access.cpp
accel.cpp
xpmdecod.cpp
wincmn.cpp
valtext.cpp
validate.cpp
valgen.cpp
utilscmn.cpp
treebase.cpp
toplvcmn.cpp
Generating Code...
Compiling...
timercmn.cpp
textcmn.cpp
tbarbase.cpp
stockitem.cpp
statbar.cpp
srchcmn.cpp
sizer.cpp
settcmn.cpp
rgncmn.cpp
rendcmn.cpp
radiocmn.cpp
quantize.cpp
prntbase.cpp
popupcmn.cpp
pickerbase.cpp
paper.cpp
overlaycmn.cpp
nbkbase.cpp
msgout.cpp
menucmn.cpp
Generating Code...
Compiling...
matrix.cpp
listctrlcmn.cpp
lboxcmn.cpp
layout.cpp
imagxpm.cpp
imagtiff.cpp
imagtga.cpp
imagpnm.cpp
imagpng.cpp
imagpcx.cpp
imagjpeg.cpp
imagiff.cpp
imaggif.cpp
imagfill.cpp
image.cpp
imagbmp.cpp
imagall.cpp
iconbndl.cpp
helpbase.cpp
graphcmn.cpp
Generating Code...
Compiling...
gifdecod.cpp
geometry.cpp
gdicmn.cpp
gbsizer.cpp
gaugecmn.cpp
fs_mem.cpp
framecmn.cpp
fontpickercmn.cpp
fontmap.cpp
fontenumcmn.cpp
fontcmn.cpp
fldlgcmn.cpp
filepickercmn.cpp
fddlgcmn.cpp
evtloopcmn.cpp
event.cpp
effects.cpp
dseldlg.cpp
dpycmn.cpp
docview.cpp
Generating Code...
Compiling...
docmdi.cpp
dobjcmn.cpp
dndcmn.cpp
dlgcmn.cpp
dcgraph.cpp
dcbufcmn.cpp
dcbase.cpp
datacmn.cpp
ctrlsub.cpp
ctrlcmn.cpp
cshelp.cpp
containr.cpp
combocmn.cpp
colourcmn.cpp
cmndata.cpp
cmdproc.cpp
clrpickercmn.cpp
clipcmn.cpp
choiccmn.cpp
bookctrl.cpp
Generating Code...
Compiling...
bmpbase.cpp
artstd.cpp
artprov.cpp
appcmn.cpp
anidecod.cpp
accesscmn.cpp
Generating Code...
Compiling resources...
Linking...
   Creating library ..\..\lib\vc_dll\wxmsw28ud_core.lib and object ..\..\lib\vc_dll\wxmsw28ud_core.exp

Build log was saved at "file://c:\cygwin\home\dan\fullchandler\wx\trunk\build\msw\vc_mswuddll\core\BuildLog.htm"
core - 0 error(s), 3 warning(s)


------ Build started: Project: html, Configuration: DLL Unicode Debug Win32 ------

Compiling...
dummy.cpp
Compiling...
winpars.cpp
m_tables.cpp
m_style.cpp
m_pre.cpp
m_list.cpp
m_links.cpp
m_layout.cpp
m_image.cpp
m_hline.cpp
m_fonts.cpp
m_dflist.cpp
htmprint.cpp
htmlwin.cpp
htmltag.cpp
htmlpars.cpp
htmlfilt.cpp
htmlcell.cpp
helpwnd.cpp
helpfrm.cpp
helpdlg.cpp
Generating Code...
Compiling...
helpdata.cpp
helpctrl.cpp
htmllbox.cpp
helpbest.cpp
Generating Code...
Compiling resources...
Linking...
   Creating library ..\..\lib\vc_dll\wxmsw28ud_html.lib and object ..\..\lib\vc_dll\wxmsw28ud_html.exp

Build log was saved at "file://c:\cygwin\home\dan\fullchandler\wx\trunk\build\msw\vc_mswuddll\html\BuildLog.htm"
html - 0 error(s), 0 warning(s)


------ Build started: Project: xml, Configuration: DLL Unicode Debug Win32 ------

Compiling...
dummy.cpp
Compiling...
xml.cpp
xtixml.cpp
Generating Code...
Compiling resources...
Linking...
   Creating library ..\..\lib\vc_dll\wxbase28ud_xml.lib and object ..\..\lib\vc_dll\wxbase28ud_xml.exp

Build log was saved at "file://c:\cygwin\home\dan\fullchandler\wx\trunk\build\msw\vc_mswuddll\xml\BuildLog.htm"
xml - 0 error(s), 0 warning(s)


------ Build started: Project: adv, Configuration: DLL Unicode Debug Win32 ------

Compiling...
dummy.cpp
Compiling...
wizard.cpp
tipdlg.cpp
splash.cpp
sashwin.cpp
propdlg.cpp
odcombo.cpp
minical.cpp
laywin.cpp
hyperlink.cpp
helpext.cpp
gridsel.cpp
gridctrl.cpp
grid.cpp
\cygwin\home\dan\fullchandler\wx\trunk\src\generic\grid.cpp(10822) : warning C4100: 'refresh' : unreferenced formal parameter
datectlg.cpp
datavgen.cpp
colheader.cpp
calctrl.cpp
bmpcboxg.cpp
animateg.cpp
aboutdlgg.cpp
Generating Code...
Compiling...
taskbar.cpp
sound.cpp
joystick.cpp
datectrl.cpp
aboutdlg.cpp
taskbarcmn.cpp
datavcmn.cpp
animatecmn.cpp
Generating Code...
Compiling resources...
Linking...
   Creating library ..\..\lib\vc_dll\wxmsw28ud_adv.lib and object ..\..\lib\vc_dll\wxmsw28ud_adv.exp

Build log was saved at "file://c:\cygwin\home\dan\fullchandler\wx\trunk\build\msw\vc_mswuddll\adv\BuildLog.htm"
adv - 0 error(s), 1 warning(s)


------ Build started: Project: qa, Configuration: DLL Unicode Debug Win32 ------

Compiling...
dummy.cpp
Compiling...
dbgrptg.cpp
debugrpt.cpp
Generating Code...
Compiling resources...
Linking...
   Creating library ..\..\lib\vc_dll\wxmsw28ud_qa.lib and object ..\..\lib\vc_dll\wxmsw28ud_qa.exp

Build log was saved at "file://c:\cygwin\home\dan\fullchandler\wx\trunk\build\msw\vc_mswuddll\qa\BuildLog.htm"
qa - 0 error(s), 0 warning(s)


------ Build started: Project: xrc, Configuration: DLL Unicode Debug Win32 ------

Compiling...
dummy.cpp
Compiling...
xmlrsall.cpp
xmlres.cpp
xh_wizrd.cpp
xh_unkwn.cpp
xh_treebk.cpp
xh_tree.cpp
xh_toolb.cpp
xh_tglbtn.cpp
xh_text.cpp
xh_sttxt.cpp
xh_stlin.cpp
xh_stbox.cpp
xh_stbmp.cpp
xh_statbar.cpp
xh_split.cpp
xh_spin.cpp
xh_slidr.cpp
xh_sizer.cpp
xh_scwin.cpp
xh_scrol.cpp
Generating Code...
Compiling...
xh_radbx.cpp
xh_radbt.cpp
xh_panel.cpp
xh_odcombo.cpp
xh_notbk.cpp
xh_menu.cpp
xh_mdi.cpp
xh_listc.cpp
xh_listbk.cpp
xh_listb.cpp
xh_hyperlink.cpp
xh_htmllbox.cpp
xh_html.cpp
xh_grid.cpp
xh_gdctl.cpp
xh_gauge.cpp
xh_frame.cpp
xh_fontpicker.cpp
xh_filepicker.cpp
xh_dlg.cpp
Generating Code...
Compiling...
xh_dirpicker.cpp
xh_datectrl.cpp
xh_combo.cpp
xh_collpane.cpp
xh_clrpicker.cpp
xh_choicbk.cpp
xh_choic.cpp
xh_chckl.cpp
xh_chckb.cpp
xh_cald.cpp
xh_bttn.cpp
xh_bmpcbox.cpp
xh_bmpbt.cpp
xh_bmp.cpp
xh_animatctrl.cpp
Generating Code...
Compiling resources...
Linking...
   Creating library ..\..\lib\vc_dll\wxmsw28ud_xrc.lib and object ..\..\lib\vc_dll\wxmsw28ud_xrc.exp

Build log was saved at "file://c:\cygwin\home\dan\fullchandler\wx\trunk\build\msw\vc_mswuddll\xrc\BuildLog.htm"
xrc - 0 error(s), 0 warning(s)


------ Build started: Project: aui, Configuration: DLL Unicode Debug Win32 ------

Compiling...
dummy.cpp
Compiling...
tabmdi.cpp
framemanager.cpp
floatpane.cpp
dockart.cpp
auibook.cpp
Generating Code...
Compiling resources...
Linking...
   Creating library ..\..\lib\vc_dll\wxmsw28ud_aui.lib and object ..\..\lib\vc_dll\wxmsw28ud_aui.exp

Build log was saved at "file://c:\cygwin\home\dan\fullchandler\wx\trunk\build\msw\vc_mswuddll\aui\BuildLog.htm"
aui - 0 error(s), 0 warning(s)


------ Build started: Project: richtext, Configuration: DLL Unicode Debug Win32 ------

Compiling...
dummy.cpp
Compiling...
richtextxml.cpp
richtextsymboldlg.cpp
richtextstyles.cpp
richtextstyledlg.cpp
richtextprint.cpp
richtexthtml.cpp
richtextformatdlg.cpp
richtextctrl.cpp
richtextbuffer.cpp
Generating Code...
c:\cygwin\home\dan\fullchandler\wx\trunk\src\richtext\richtextctrl.cpp(2008) : warning C4702: unreachable code
Compiling resources...
Linking...
   Creating library ..\..\lib\vc_dll\wxmsw28ud_richtext.lib and object ..\..\lib\vc_dll\wxmsw28ud_richtext.exp

Build log was saved at "file://c:\cygwin\home\dan\fullchandler\wx\trunk\build\msw\vc_mswuddll\richtext\BuildLog.htm"
richtext - 0 error(s), 1 warning(s)


------ Build started: Project: gizmos, Configuration: DLL Unicode Debug Win32 ------

Compiling...
dummy.cpp
Compiling...
statpict.cpp
splittree.cpp
multicell.cpp
ledctrl.cpp
editlbox.cpp
dynamicsash.cpp
Generating Code...
Compiling resources...
Linking...
   Creating library ..\..\src\gizmos\..\..\..\lib\vc_dll\wxmsw28ud_gizmos.lib and object ..\..\src\gizmos\..\..\..\lib\vc_dll\wxms
w28ud_gizmos.exp

Build log was saved at "file://c:\cygwin\home\dan\fullchandler\wx\trunk\contrib\build\gizmos\vc_mswuddll\gizmos\BuildLog.htm"
gizmos - 0 error(s), 0 warning(s)


------ Build started: Project: stc, Configuration: DLL Unicode Debug Win32 ------

Compiling...
stc.cpp
ScintillaWX.cpp
PlatWX.cpp
\cygwin\home\dan\fullchandler\wx\trunk\contrib\src\stc\PlatWX.cpp(1429) : warning C4100: 'format' : unreferenced formal parameter
Generating Code...
Compiling resources...
Linking...
   Creating library ..\..\src\stc\..\..\..\lib\vc_dll\wxmsw28ud_stc.lib and object ..\..\src\stc\..\..\..\lib\vc_dll\wxmsw28ud_stc
.exp

Build log was saved at "file://c:\cygwin\home\dan\fullchandler\wx\trunk\contrib\build\stc\vc_mswuddll\stc\BuildLog.htm"
stc - 0 error(s), 1 warning(s)


------ Build started: Project: media, Configuration: DLL Unicode Debug Win32 ------

Compiling...
dummy.cpp
Compiling...
mediactrl_wmp10.cpp
mediactrl_qt.cpp
mediactrl_am.cpp
activex.cpp
mediactrlcmn.cpp
Generating Code...
Compiling resources...
Linking...
   Creating library ..\..\lib\vc_dll\wxmsw28ud_media.lib and object ..\..\lib\vc_dll\wxmsw28ud_media.exp

Build log was saved at "file://c:\cygwin\home\dan\fullchandler\wx\trunk\build\msw\vc_mswuddll\media\BuildLog.htm"
media - 0 error(s), 0 warning(s)


---------------------- Done ----------------------

    Build: 19 succeeded, 0 failed, 0 skipped


make -C /home/dan/fullchandler/wx/trunk/locale allmo
make[1]: Entering directory `/home/dan/fullchandler/wx/trunk/locale'
make[2]: Entering directory `/home/dan/fullchandler/wx/trunk/locale'
msgfmt --verbose -c -o af.mo af.po
make[2]: msgfmt: Command not found
make[2]: *** [af.mo] Error 127
make[2]: Leaving directory `/home/dan/fullchandler/wx/trunk/locale'
make[2]: Entering directory `/home/dan/fullchandler/wx/trunk/locale'
msgfmt --verbose -c -o ca.mo ca.po
make[2]: msgfmt: Command not found
make[2]: *** [ca.mo] Error 127
make[2]: Leaving directory `/home/dan/fullchandler/wx/trunk/locale'
make[2]: Entering directory `/home/dan/fullchandler/wx/trunk/locale'
if [ -f cs.po ]; then msgmerge cs.po wxstd.po > cs.po.new && mv cs.po.new cs.po; else cp wxstd.po cs.po; fi
/bin/sh: msgmerge: command not found
make[2]: *** [cs.po] Error 127
make[2]: Leaving directory `/home/dan/fullchandler/wx/trunk/locale'
make[2]: Entering directory `/home/dan/fullchandler/wx/trunk/locale'
msgfmt --verbose -c -o da.mo da.po
make[2]: msgfmt: Command not found
make[2]: *** [da.mo] Error 127
make[2]: Leaving directory `/home/dan/fullchandler/wx/trunk/locale'
make[2]: Entering directory `/home/dan/fullchandler/wx/trunk/locale'
msgfmt --verbose -c -o de.mo de.po
make[2]: msgfmt: Command not found
make[2]: *** [de.mo] Error 127
make[2]: Leaving directory `/home/dan/fullchandler/wx/trunk/locale'
make[2]: Entering directory `/home/dan/fullchandler/wx/trunk/locale'
msgfmt --verbose -c -o el.mo el.po
make[2]: msgfmt: Command not found
make[2]: *** [el.mo] Error 127
make[2]: Leaving directory `/home/dan/fullchandler/wx/trunk/locale'
make[2]: Entering directory `/home/dan/fullchandler/wx/trunk/locale'
if [ -f es.po ]; then msgmerge es.po wxstd.po > es.po.new && mv es.po.new es.po; else cp wxstd.po es.po; fi
/bin/sh: msgmerge: command not found
make[2]: *** [es.po] Error 127
make[2]: Leaving directory `/home/dan/fullchandler/wx/trunk/locale'
make[2]: Entering directory `/home/dan/fullchandler/wx/trunk/locale'
msgfmt --verbose -c -o eu.mo eu.po
make[2]: msgfmt: Command not found
make[2]: *** [eu.mo] Error 127
make[2]: Leaving directory `/home/dan/fullchandler/wx/trunk/locale'
make[2]: Entering directory `/home/dan/fullchandler/wx/trunk/locale'
msgfmt --verbose -c -o fi.mo fi.po
make[2]: msgfmt: Command not found
make[2]: *** [fi.mo] Error 127
make[2]: Leaving directory `/home/dan/fullchandler/wx/trunk/locale'
make[2]: Entering directory `/home/dan/fullchandler/wx/trunk/locale'
msgfmt --verbose -c -o fr.mo fr.po
make[2]: msgfmt: Command not found
make[2]: *** [fr.mo] Error 127
make[2]: Leaving directory `/home/dan/fullchandler/wx/trunk/locale'
make[2]: Entering directory `/home/dan/fullchandler/wx/trunk/locale'
msgfmt --verbose -c -o gl_ES.mo gl_ES.po
make[2]: msgfmt: Command not found
make[2]: *** [gl_ES.mo] Error 127
make[2]: Leaving directory `/home/dan/fullchandler/wx/trunk/locale'
make[2]: Entering directory `/home/dan/fullchandler/wx/trunk/locale'
msgfmt --verbose -c -o hi.mo hi.po
make[2]: msgfmt: Command not found
make[2]: *** [hi.mo] Error 127
make[2]: Leaving directory `/home/dan/fullchandler/wx/trunk/locale'
make[2]: Entering directory `/home/dan/fullchandler/wx/trunk/locale'
msgfmt --verbose -c -o hu.mo hu.po
make[2]: msgfmt: Command not found
make[2]: *** [hu.mo] Error 127
make[2]: Leaving directory `/home/dan/fullchandler/wx/trunk/locale'
make[2]: Entering directory `/home/dan/fullchandler/wx/trunk/locale'
msgfmt --verbose -c -o id.mo id.po
make[2]: msgfmt: Command not found
make[2]: *** [id.mo] Error 127
make[2]: Leaving directory `/home/dan/fullchandler/wx/trunk/locale'
make[2]: Entering directory `/home/dan/fullchandler/wx/trunk/locale'
msgfmt --verbose -c -o it.mo it.po
make[2]: msgfmt: Command not found
make[2]: *** [it.mo] Error 127
make[2]: Leaving directory `/home/dan/fullchandler/wx/trunk/locale'
make[2]: Entering directory `/home/dan/fullchandler/wx/trunk/locale'
msgfmt --verbose -c -o ja.mo ja.po
make[2]: msgfmt: Command not found
make[2]: *** [ja.mo] Error 127
make[2]: Leaving directory `/home/dan/fullchandler/wx/trunk/locale'
make[2]: Entering directory `/home/dan/fullchandler/wx/trunk/locale'
msgfmt --verbose -c -o lv.mo lv.po
make[2]: msgfmt: Command not found
make[2]: *** [lv.mo] Error 127
make[2]: Leaving directory `/home/dan/fullchandler/wx/trunk/locale'
make[2]: Entering directory `/home/dan/fullchandler/wx/trunk/locale'
msgfmt --verbose -c -o ms.mo ms.po
make[2]: msgfmt: Command not found
make[2]: *** [ms.mo] Error 127
make[2]: Leaving directory `/home/dan/fullchandler/wx/trunk/locale'
make[2]: Entering directory `/home/dan/fullchandler/wx/trunk/locale'
if [ -f msw/it.po ]; then msgmerge msw/it.po wxstd.po > msw/it.po.new && mv msw/it.po.new msw/it.po; else cp wxstd.po msw/it.po; f
i
/bin/sh: msgmerge: command not found
make[2]: *** [msw/it.po] Error 127
make[2]: Leaving directory `/home/dan/fullchandler/wx/trunk/locale'
make[2]: Entering directory `/home/dan/fullchandler/wx/trunk/locale'
msgfmt --verbose -c -o nb.mo nb.po
make[2]: msgfmt: Command not found
make[2]: *** [nb.mo] Error 127
make[2]: Leaving directory `/home/dan/fullchandler/wx/trunk/locale'
make[2]: Entering directory `/home/dan/fullchandler/wx/trunk/locale'
msgfmt --verbose -c -o nl.mo nl.po
make[2]: msgfmt: Command not found
make[2]: *** [nl.mo] Error 127
make[2]: Leaving directory `/home/dan/fullchandler/wx/trunk/locale'
make[2]: Entering directory `/home/dan/fullchandler/wx/trunk/locale'
msgfmt --verbose -c -o pl.mo pl.po
make[2]: msgfmt: Command not found
make[2]: *** [pl.mo] Error 127
make[2]: Leaving directory `/home/dan/fullchandler/wx/trunk/locale'
make[2]: Entering directory `/home/dan/fullchandler/wx/trunk/locale'
if [ -f pt_BR.po ]; then msgmerge pt_BR.po wxstd.po > pt_BR.po.new && mv pt_BR.po.new pt_BR.po; else cp wxstd.po pt_BR.po; fi
/bin/sh: msgmerge: command not found
make[2]: *** [pt_BR.po] Error 127
make[2]: Leaving directory `/home/dan/fullchandler/wx/trunk/locale'
make[2]: Entering directory `/home/dan/fullchandler/wx/trunk/locale'
msgfmt --verbose -c -o ru.mo ru.po
make[2]: msgfmt: Command not found
make[2]: *** [ru.mo] Error 127
make[2]: Leaving directory `/home/dan/fullchandler/wx/trunk/locale'
make[2]: Entering directory `/home/dan/fullchandler/wx/trunk/locale'
msgfmt --verbose -c -o sl.mo sl.po
make[2]: msgfmt: Command not found
make[2]: *** [sl.mo] Error 127
make[2]: Leaving directory `/home/dan/fullchandler/wx/trunk/locale'
make[2]: Entering directory `/home/dan/fullchandler/wx/trunk/locale'
msgfmt --verbose -c -o sq.mo sq.po
make[2]: msgfmt: Command not found
make[2]: *** [sq.mo] Error 127
make[2]: Leaving directory `/home/dan/fullchandler/wx/trunk/locale'
make[2]: Entering directory `/home/dan/fullchandler/wx/trunk/locale'
msgfmt --verbose -c -o sv.mo sv.po
make[2]: msgfmt: Command not found
make[2]: *** [sv.mo] Error 127
make[2]: Leaving directory `/home/dan/fullchandler/wx/trunk/locale'
make[2]: Entering directory `/home/dan/fullchandler/wx/trunk/locale'
msgfmt --verbose -c -o tr.mo tr.po
make[2]: msgfmt: Command not found
make[2]: *** [tr.mo] Error 127
make[2]: Leaving directory `/home/dan/fullchandler/wx/trunk/locale'
make[2]: Entering directory `/home/dan/fullchandler/wx/trunk/locale'
msgfmt --verbose -c -o uk.mo uk.po
make[2]: msgfmt: Command not found
make[2]: *** [uk.mo] Error 127
make[2]: Leaving directory `/home/dan/fullchandler/wx/trunk/locale'
make[2]: Entering directory `/home/dan/fullchandler/wx/trunk/locale'
msgfmt --verbose -c -o zh_CN.mo zh_CN.po
make[2]: msgfmt: Command not found
make[2]: *** [zh_CN.mo] Error 127
make[2]: Leaving directory `/home/dan/fullchandler/wx/trunk/locale'
make[2]: Entering directory `/home/dan/fullchandler/wx/trunk/locale'
msgfmt --verbose -c -o zh_TW.mo zh_TW.po
make[2]: msgfmt: Command not found
make[2]: *** [zh_TW.mo] Error 127
make[2]: Leaving directory `/home/dan/fullchandler/wx/trunk/locale'
make[1]: *** [allmo] Error 2
make[1]: Leaving directory `/home/dan/fullchandler/wx/trunk/locale'
make: *** [buildMOs] Error 2

dan@osafound-efy68w ~/fullchandler/wx/trunk