rendered paste bodyNOTE: Running task 90 of 3368 (ID: 44, /home/zero/oe/org.openembedded.dev/packages/file/file-native_4.20.bb, do_compile)
NOTE: package file-native-4.20: started
NOTE: package file-native-4.20-r0: task do_compile: started
ERROR: function do_compile failed
ERROR: log data follows (/mnt/storage/oetmp-angstrom/work/i686-linux/file-native-4.20-r0/temp/log.do_compile.29327)
| NOTE: make -j 1
| make all-recursive
| make[1]: Entering directory `/mnt/storage/oetmp-angstrom/work/i686-linux/file-native-4.20-r0/file-4.20'
| Making all in src
| make[2]: Entering directory `/mnt/storage/oetmp-angstrom/work/i686-linux/file-native-4.20-r0/file-4.20/src'
| if /bin/sh ../i686-linux-libtool --tag=CC --mode=compile gcc -DHAVE_CONFIG_H -I. -I/mnt/storage/oetmp-angstrom/work/i686-linux/file-native-4.20-r0/file-4.20/src -I.. -DMAGIC='"/mnt/storage/oetmp-angstrom/staging/i686-linux/share/file/magic"' -isystem/mnt/storage/oetmp-angstrom/staging/i686-linux/include -isystem/mnt/storage/oetmp-angstrom/staging/i686-linux/include -Os -MT softmagic.lo -MD -MP -MF ".deps/softmagic.Tpo" -c -o softmagic.lo softmagic.c; \
| then mv -f ".deps/softmagic.Tpo" ".deps/softmagic.Plo"; else rm -f ".deps/softmagic.Tpo"; exit 1; fi
| gcc -DHAVE_CONFIG_H -I. -I/mnt/storage/oetmp-angstrom/work/i686-linux/file-native-4.20-r0/file-4.20/src -I.. -DMAGIC=\"/mnt/storage/oetmp-angstrom/staging/i686-linux/share/file/magic\" -isystem/mnt/storage/oetmp-angstrom/staging/i686-linux/include -isystem/mnt/storage/oetmp-angstrom/staging/i686-linux/include -Os -MT softmagic.lo -MD -MP -MF .deps/softmagic.Tpo -c softmagic.c -fPIC -DPIC -o .libs/softmagic.o
| softmagic.c: In function `mprint':
| softmagic.c:478: warning: assignment makes pointer from integer without a cast
| softmagic.c: In function `magiccheck':
| softmagic.c:1529: `REG_STARTEND' undeclared (first use in this function)
| softmagic.c:1529: (Each undeclared identifier is reported only once
| softmagic.c:1529: for each function it appears in.)
| make[2]: *** [softmagic.lo] Error 1
| make[2]: Leaving directory `/mnt/storage/oetmp-angstrom/work/i686-linux/file-native-4.20-r0/file-4.20/src'
| make[1]: *** [all-recursive] Error 1
| make[1]: Leaving directory `/mnt/storage/oetmp-angstrom/work/i686-linux/file-native-4.20-r0/file-4.20'
| make: *** [all] Error 2
| FATAL: oe_runmake failed
NOTE: Task failed: /mnt/storage/oetmp-angstrom/work/i686-linux/file-native-4.20-r0/temp/log.do_compile.29327
NOTE: package file-native-4.20-r0: task do_compile: failed
ERROR: TaskFailed event exception, aborting
NOTE: package file-native-4.20: failed
ERROR: Build of /home/zero/oe/org.openembedded.dev/packages/file/file-native_4.20.bb do_compile failed
ERROR: Task 44 (/home/zero/oe/org.openembedded.dev/packages/file/file-native_4.20.bb, do_compile) failed
ERROR: '/home/zero/oe/org.openembedded.dev/packages/file/file-native_4.20.bb' failed