All pastes #412536 Raw Edit

seetu

public text v1 · immutable
#412536 ·published 2007-03-27 19:16 UTC
rendered paste body
e-msgport.c:39:18: error: nspr.h: No such file or directory
e-msgport.c:492: error: expected specifier-qualifier-list before 'PRFileDesc'
e-msgport.c:504: error: expected ')' before '*' token
e-msgport.c:539: error: expected ')' before '*' token
e-msgport.c: In function 'e_msgport_new':
e-msgport.c:567: error: 'EMsgPort' has no member named 'prpipe'
e-msgport.c:568: error: 'EMsgPort' has no member named 'prpipe'
e-msgport.c: In function 'e_msgport_destroy':
e-msgport.c:584: error: 'EMsgPort' has no member named 'prpipe'
e-msgport.c:585: warning: implicit declaration of function 'PR_Close'
e-msgport.c:585: error: 'EMsgPort' has no member named 'prpipe'
e-msgport.c:586: error: 'EMsgPort' has no member named 'prpipe'
e-msgport.c: At top level:
e-msgport.c:611: error: expected '=', ',', ';', 'asm' or '__attribute__' before '*' token
e-msgport.c: In function 'e_msgport_put':
e-msgport.c:633: error: 'PRFileDesc' undeclared (first use in this function)
e-msgport.c:633: error: (Each undeclared identifier is reported only once
e-msgport.c:633: error: for each function it appears in.)
e-msgport.c:633: error: 'prfd' undeclared (first use in this function)
e-msgport.c:656: error: 'EMsgPort' has no member named 'prpipe'
e-msgport.c:658: warning: implicit declaration of function 'PR_Write'
e-msgport.c:661: warning: implicit declaration of function 'PR_GetError'
e-msgport.c:661: error: 'PR_PENDING_INTERRUPT_ERROR' undeclared (first use in this function)
e-msgport.c:662: warning: implicit declaration of function 'PR_GetErrorTextLength'
e-msgport.c:663: warning: implicit declaration of function 'PR_GetErrorText'
e-msgport.c: In function 'e_msgport_wait':
e-msgport.c:692: warning: implicit declaration of function 'msgport_sync_with_prpipe'
e-msgport.c:692: error: 'EMsgPort' has no member named 'prpipe'
e-msgport.c: In function 'e_msgport_get':
e-msgport.c:715: error: 'EMsgPort' has no member named 'prpipe'
make[2]: *** [e-msgport.lo] Error 1
make[2]: Leaving directory `/home/sheethal/cvs/gnome/evolution-data-server/libedataserver'
make[1]: *** [all-recursive] Error 1
make[1]: Leaving directory `/home/sheethal/cvs/gnome/evolution-data-server'
make: *** [all] Error 2
sheethal@sheethal:~/cvs/gnome/evolution-data-server>