rendered paste bodyroot@obelix vbox # kmk all
sed: can't read /usr/src/linux/Makefile: No such file or directory
kBuild: Pass - Build Programs
kmk[1]: Entering directory `/home/reon/vbox/src'
kmk[2]: Entering directory `/home/reon/vbox/src/bldprogs'
kmk[2]: Nothing to be done for `pass_bldprogs'.
kmk[2]: Leaving directory `/home/reon/vbox/src/bldprogs'
kmk[2]: Entering directory `/home/reon/vbox/src/libs'
kmk[3]: Entering directory `/home/reon/vbox/src/libs/xpcom18a4'
kmk[3]: Nothing to be done for `pass_bldprogs'.
kmk[3]: Leaving directory `/home/reon/vbox/src/libs/xpcom18a4'
kmk[2]: Leaving directory `/home/reon/vbox/src/libs'
kmk[2]: Entering directory `/home/reon/vbox/src/VBox'
kmk[3]: Entering directory `/home/reon/vbox/src/VBox/Devices'
kmk[4]: Entering directory `/home/reon/vbox/src/VBox/Devices/testcase'
kmk[4]: Nothing to be done for `pass_bldprogs'.
kmk[4]: Leaving directory `/home/reon/vbox/src/VBox/Devices/testcase'
kmk[4]: Entering directory `/home/reon/vbox/src/VBox/Devices/PC/BIOS'
kmk[4]: Nothing to be done for `pass_bldprogs'.
kmk[4]: Leaving directory `/home/reon/vbox/src/VBox/Devices/PC/BIOS'
kmk[4]: Entering directory `/home/reon/vbox/src/VBox/Devices/PC/Etherboot-src'
kmk[4]: Nothing to be done for `pass_bldprogs'.
kmk[4]: Leaving directory `/home/reon/vbox/src/VBox/Devices/PC/Etherboot-src'
kmk[4]: Entering directory `/home/reon/vbox/src/VBox/Devices/Graphics/BIOS'
kmk[4]: Nothing to be done for `pass_bldprogs'.
kmk[4]: Leaving directory `/home/reon/vbox/src/VBox/Devices/Graphics/BIOS'
kmk[4]: Entering directory `/home/reon/vbox/src/VBox/Devices/Storage/testcase'
kmk[4]: Nothing to be done for `pass_bldprogs'.
kmk[4]: Leaving directory `/home/reon/vbox/src/VBox/Devices/Storage/testcase'
kmk[3]: Leaving directory `/home/reon/vbox/src/VBox/Devices'
kmk[2]: Leaving directory `/home/reon/vbox/src/VBox'
kmk[2]: Entering directory `/home/reon/vbox/src/recompiler/new'
kmk[2]: Nothing to be done for `pass_bldprogs'.
kmk[2]: Leaving directory `/home/reon/vbox/src/recompiler/new'
kmk[2]: Entering directory `/home/reon/vbox/src/testcase'
kmk[2]: Nothing to be done for `pass_bldprogs'.
kmk[2]: Leaving directory `/home/reon/vbox/src/testcase'
kmk[1]: Leaving directory `/home/reon/vbox/src'
kBuild: Pass - Libraries
kmk[1]: Entering directory `/home/reon/vbox/src'
kmk[2]: Entering directory `/home/reon/vbox/src/bldprogs'
kmk[2]: Nothing to be done for `pass_libraries'.
kmk[2]: Leaving directory `/home/reon/vbox/src/bldprogs'
kmk[2]: Entering directory `/home/reon/vbox/src/libs'
kmk[3]: Entering directory `/home/reon/vbox/src/libs/liblzf-1.51'
kmk[3]: Nothing to be done for `pass_libraries'.
kmk[3]: Leaving directory `/home/reon/vbox/src/libs/liblzf-1.51'
kmk[3]: Entering directory `/home/reon/vbox/src/libs/xpcom18a4'
kmk[3]: Nothing to be done for `pass_libraries'.
kmk[3]: Leaving directory `/home/reon/vbox/src/libs/xpcom18a4'
kmk[2]: Leaving directory `/home/reon/vbox/src/libs'
kmk[2]: Entering directory `/home/reon/vbox/src/VBox'
kmk[3]: Entering directory `/home/reon/vbox/src/VBox/Runtime'
kBuild: Compiling RuntimeR0Drv - misc/sanity-c.c
In file included from /home/reon/vbox/src/VBox/Runtime/misc/sanity.h:25,
from /home/reon/vbox/src/VBox/Runtime/misc/sanity-c.c:24:
/home/reon/vbox/include/iprt/types.h:55:27: error: linux/types.h: No such file or directory
/home/reon/vbox/include/iprt/types.h:56:28: error: linux/stddef.h: No such file or directory
In file included from /home/reon/vbox/src/VBox/Runtime/misc/sanity.h:25,
from /home/reon/vbox/src/VBox/Runtime/misc/sanity-c.c:24:
/home/reon/vbox/include/iprt/types.h:144: error: expected specifier-qualifier-list before ‘uint16_t’
/home/reon/vbox/include/iprt/types.h:169: error: expected specifier-qualifier-list before ‘uint32_t’
/home/reon/vbox/include/iprt/types.h:202: error: expected specifier-qualifier-list before ‘uint64_t’
/home/reon/vbox/include/iprt/types.h:250: error: expected specifier-qualifier-list before ‘uint64_t’
/home/reon/vbox/include/iprt/types.h:256: error: expected specifier-qualifier-list before ‘uint64_t’
/home/reon/vbox/include/iprt/types.h:262: error: expected specifier-qualifier-list before ‘uint32_t’
/home/reon/vbox/include/iprt/types.h:270: error: expected specifier-qualifier-list before ‘uint16_t’
/home/reon/vbox/include/iprt/types.h:281: error: expected specifier-qualifier-list before ‘uint64_t’
/home/reon/vbox/include/iprt/types.h:328: error: expected ‘=’, ‘,’, ‘;’, ‘asm’ or ‘__attribute__’ before ‘RTINTPTR’
/home/reon/vbox/include/iprt/types.h:333: error: expected ‘=’, ‘,’, ‘;’, ‘asm’ or ‘__attribute__’ before ‘*’ token
/home/reon/vbox/include/iprt/types.h:335: error: expected ‘=’, ‘,’, ‘;’, ‘asm’ or ‘__attribute__’ before ‘*’ token
/home/reon/vbox/include/iprt/types.h:341: error: expected ‘=’, ‘,’, ‘;’, ‘asm’ or ‘__attribute__’ before ‘RTUINTPTR’
/home/reon/vbox/include/iprt/types.h:346: error: expected ‘=’, ‘,’, ‘;’, ‘asm’ or ‘__attribute__’ before ‘*’ token
/home/reon/vbox/include/iprt/types.h:348: error: expected ‘=’, ‘,’, ‘;’, ‘asm’ or ‘__attribute__’ before ‘*’ token
/home/reon/vbox/include/iprt/types.h:351: error: expected ‘=’, ‘,’, ‘;’, ‘asm’ or ‘__attribute__’ before ‘RTINT’
/home/reon/vbox/include/iprt/types.h:353: error: expected ‘=’, ‘,’, ‘;’, ‘asm’ or ‘__attribute__’ before ‘*’ token
/home/reon/vbox/include/iprt/types.h:355: error: expected ‘=’, ‘,’, ‘;’, ‘asm’ or ‘__attribute__’ before ‘*’ token
/home/reon/vbox/include/iprt/types.h:358: error: expected ‘=’, ‘,’, ‘;’, ‘asm’ or ‘__attribute__’ before ‘RTUINT’
/home/reon/vbox/include/iprt/types.h:360: error: expected ‘=’, ‘,’, ‘;’, ‘asm’ or ‘__attribute__’ before ‘*’ token
/home/reon/vbox/include/iprt/types.h:362: error: expected ‘=’, ‘,’, ‘;’, ‘asm’ or ‘__attribute__’ before ‘*’ token
/home/reon/vbox/include/iprt/types.h:365: error: expected ‘=’, ‘,’, ‘;’, ‘asm’ or ‘__attribute__’ before ‘RTFOFF’
/home/reon/vbox/include/iprt/types.h:367: error: expected ‘=’, ‘,’, ‘;’, ‘asm’ or ‘__attribute__’ before ‘*’ token
/home/reon/vbox/include/iprt/types.h:370: error: expected ‘=’, ‘,’, ‘;’, ‘asm’ or ‘__attribute__’ before ‘RTFMODE’
/home/reon/vbox/include/iprt/types.h:372: error: expected ‘=’, ‘,’, ‘;’, ‘asm’ or ‘__attribute__’ before ‘*’ token
/home/reon/vbox/include/iprt/types.h:375: error: expected ‘=’, ‘,’, ‘;’, ‘asm’ or ‘__attribute__’ before ‘RTDEV’
/home/reon/vbox/include/iprt/types.h:377: error: expected ‘=’, ‘,’, ‘;’, ‘asm’ or ‘__attribute__’ before ‘*’ token
/home/reon/vbox/include/iprt/types.h:380: error: expected ‘=’, ‘,’, ‘;’, ‘asm’ or ‘__attribute__’ before ‘RTINODE’
/home/reon/vbox/include/iprt/types.h:382: error: expected ‘=’, ‘,’, ‘;’, ‘asm’ or ‘__attribute__’ before ‘*’ token
/home/reon/vbox/include/iprt/types.h:385: error: expected ‘=’, ‘,’, ‘;’, ‘asm’ or ‘__attribute__’ before ‘RTUID’
/home/reon/vbox/include/iprt/types.h:387: error: expected ‘=’, ‘,’, ‘;’, ‘asm’ or ‘__attribute__’ before ‘*’ token
/home/reon/vbox/include/iprt/types.h:393: error: expected ‘=’, ‘,’, ‘;’, ‘asm’ or ‘__attribute__’ before ‘RTGID’
/home/reon/vbox/include/iprt/types.h:395: error: expected ‘=’, ‘,’, ‘;’, ‘asm’ or ‘__attribute__’ before ‘*’ token
/home/reon/vbox/include/iprt/types.h:401: error: expected ‘=’, ‘,’, ‘;’, ‘asm’ or ‘__attribute__’ before ‘RTIOPORT’
/home/reon/vbox/include/iprt/types.h:403: error: expected ‘=’, ‘,’, ‘;’, ‘asm’ or ‘__attribute__’ before ‘*’ token
/home/reon/vbox/include/iprt/types.h:405: error: expected ‘=’, ‘,’, ‘;’, ‘asm’ or ‘__attribute__’ before ‘*’ token
/home/reon/vbox/include/iprt/types.h:408: error: expected ‘=’, ‘,’, ‘;’, ‘asm’ or ‘__attribute__’ before ‘RTSEL’
/home/reon/vbox/include/iprt/types.h:410: error: expected ‘=’, ‘,’, ‘;’, ‘asm’ or ‘__attribute__’ before ‘*’ token
/home/reon/vbox/include/iprt/types.h:412: error: expected ‘=’, ‘,’, ‘;’, ‘asm’ or ‘__attribute__’ before ‘*’ token
/home/reon/vbox/include/iprt/types.h:418: error: expected specifier-qualifier-list before ‘uint16_t’
/home/reon/vbox/include/iprt/types.h:431: error: expected specifier-qualifier-list before ‘uint32_t’
/home/reon/vbox/include/iprt/types.h:444: error: expected specifier-qualifier-list before ‘uint64_t’
/home/reon/vbox/include/iprt/types.h:462: error: expected ‘=’, ‘,’, ‘;’, ‘asm’ or ‘__attribute__’ before ‘RTHCINT’
/home/reon/vbox/include/iprt/types.h:464: error: expected ‘=’, ‘,’, ‘;’, ‘asm’ or ‘__attribute__’ before ‘*’ token
/home/reon/vbox/include/iprt/types.h:466: error: expected ‘=’, ‘,’, ‘;’, ‘asm’ or ‘__attribute__’ before ‘*’ token
/home/reon/vbox/include/iprt/types.h:469: error: expected ‘=’, ‘,’, ‘;’, ‘asm’ or ‘__attribute__’ before ‘RTHCUINT’
/home/reon/vbox/include/iprt/types.h:471: error: expected ‘=’, ‘,’, ‘;’, ‘asm’ or ‘__attribute__’ before ‘*’ token
/home/reon/vbox/include/iprt/types.h:473: error: expected ‘=’, ‘,’, ‘;’, ‘asm’ or ‘__attribute__’ before ‘*’ token
/home/reon/vbox/include/iprt/types.h:480: error: expected ‘=’, ‘,’, ‘;’, ‘asm’ or ‘__attribute__’ before ‘RTHCINTPTR’
/home/reon/vbox/include/iprt/types.h:485: error: expected ‘=’, ‘,’, ‘;’, ‘asm’ or ‘__attribute__’ before ‘*’ token
/home/reon/vbox/include/iprt/types.h:487: error: expected ‘=’, ‘,’, ‘;’, ‘asm’ or ‘__attribute__’ before ‘*’ token
/home/reon/vbox/include/iprt/types.h:493: error: expected ‘=’, ‘,’, ‘;’, ‘asm’ or ‘__attribute__’ before ‘RTR3INTPTR’
/home/reon/vbox/include/iprt/types.h:498: error: expected ‘=’, ‘,’, ‘;’, ‘asm’ or ‘__attribute__’ before ‘*’ token
/home/reon/vbox/include/iprt/types.h:500: error: expected ‘=’, ‘,’, ‘;’, ‘asm’ or ‘__attribute__’ before ‘*’ token
/home/reon/vbox/include/iprt/types.h:506: error: expected ‘=’, ‘,’, ‘;’, ‘asm’ or ‘__attribute__’ before ‘RTR0INTPTR’
/home/reon/vbox/include/iprt/types.h:511: error: expected ‘=’, ‘,’, ‘;’, ‘asm’ or ‘__attribute__’ before ‘*’ token
/home/reon/vbox/include/iprt/types.h:513: error: expected ‘=’, ‘,’, ‘;’, ‘asm’ or ‘__attribute__’ before ‘*’ token
/home/reon/vbox/include/iprt/types.h:520: error: expected ‘=’, ‘,’, ‘;’, ‘asm’ or ‘__attribute__’ before ‘RTHCUINTPTR’
/home/reon/vbox/include/iprt/types.h:525: error: expected ‘=’, ‘,’, ‘;’, ‘asm’ or ‘__attribute__’ before ‘*’ token
/home/reon/vbox/include/iprt/types.h:527: error: expected ‘=’, ‘,’, ‘;’, ‘asm’ or ‘__attribute__’ before ‘*’ token
/home/reon/vbox/include/iprt/types.h:533: error: expected ‘=’, ‘,’, ‘;’, ‘asm’ or ‘__attribute__’ before ‘RTR3UINTPTR’
/home/reon/vbox/include/iprt/types.h:538: error: expected ‘=’, ‘,’, ‘;’, ‘asm’ or ‘__attribute__’ before ‘*’ token
/home/reon/vbox/include/iprt/types.h:540: error: expected ‘=’, ‘,’, ‘;’, ‘asm’ or ‘__attribute__’ before ‘*’ token
/home/reon/vbox/include/iprt/types.h:546: error: expected ‘=’, ‘,’, ‘;’, ‘asm’ or ‘__attribute__’ before ‘RTR0UINTPTR’
/home/reon/vbox/include/iprt/types.h:551: error: expected ‘=’, ‘,’, ‘;’, ‘asm’ or ‘__attribute__’ before ‘*’ token
/home/reon/vbox/include/iprt/types.h:553: error: expected ‘=’, ‘,’, ‘;’, ‘asm’ or ‘__attribute__’ before ‘*’ token
/home/reon/vbox/include/iprt/types.h:559: error: expected ‘=’, ‘,’, ‘;’, ‘asm’ or ‘__attribute__’ before ‘RTHCPHYS’
/home/reon/vbox/include/iprt/types.h:561: error: expected ‘=’, ‘,’, ‘;’, ‘asm’ or ‘__attribute__’ before ‘*’ token
/home/reon/vbox/include/iprt/types.h:563: error: expected ‘=’, ‘,’, ‘;’, ‘asm’ or ‘__attribute__’ before ‘*’ token
/home/reon/vbox/include/iprt/types.h:591: error: expected ‘=’, ‘,’, ‘;’, ‘asm’ or ‘__attribute__’ before ‘RTR3PTR’
/home/reon/vbox/include/iprt/types.h:594: error: expected ‘=’, ‘,’, ‘;’, ‘asm’ or ‘__attribute__’ before ‘*’ token
/home/reon/vbox/include/iprt/types.h:596: error: expected ‘=’, ‘,’, ‘;’, ‘asm’ or ‘__attribute__’ before ‘*’ token
/home/reon/vbox/include/iprt/types.h:622: error: expected ‘=’, ‘,’, ‘;’, ‘asm’ or ‘__attribute__’ before ‘RTHCUINTREG’
/home/reon/vbox/include/iprt/types.h:627: error: expected ‘=’, ‘,’, ‘;’, ‘asm’ or ‘__attribute__’ before ‘*’ token
/home/reon/vbox/include/iprt/types.h:629: error: expected ‘=’, ‘,’, ‘;’, ‘asm’ or ‘__attribute__’ before ‘*’ token
/home/reon/vbox/include/iprt/types.h:635: error: expected ‘=’, ‘,’, ‘;’, ‘asm’ or ‘__attribute__’ before ‘RTR3UINTREG’
/home/reon/vbox/include/iprt/types.h:640: error: expected ‘=’, ‘,’, ‘;’, ‘asm’ or ‘__attribute__’ before ‘*’ token
/home/reon/vbox/include/iprt/types.h:642: error: expected ‘=’, ‘,’, ‘;’, ‘asm’ or ‘__attribute__’ before ‘*’ token
/home/reon/vbox/include/iprt/types.h:648: error: expected ‘=’, ‘,’, ‘;’, ‘asm’ or ‘__attribute__’ before ‘RTR0UINTREG’
/home/reon/vbox/include/iprt/types.h:653: error: expected ‘=’, ‘,’, ‘;’, ‘asm’ or ‘__attribute__’ before ‘*’ token
/home/reon/vbox/include/iprt/types.h:655: error: expected ‘=’, ‘,’, ‘;’, ‘asm’ or ‘__attribute__’ before ‘*’ token
/home/reon/vbox/include/iprt/types.h:666: error: expected ‘=’, ‘,’, ‘;’, ‘asm’ or ‘__attribute__’ before ‘RTGCINT’
/home/reon/vbox/include/iprt/types.h:668: error: expected ‘=’, ‘,’, ‘;’, ‘asm’ or ‘__attribute__’ before ‘*’ token
/home/reon/vbox/include/iprt/types.h:670: error: expected ‘=’, ‘,’, ‘;’, ‘asm’ or ‘__attribute__’ before ‘*’ token
/home/reon/vbox/include/iprt/types.h:673: error: expected ‘=’, ‘,’, ‘;’, ‘asm’ or ‘__attribute__’ before ‘RTGCUINT’
/home/reon/vbox/include/iprt/types.h:675: error: expected ‘=’, ‘,’, ‘;’, ‘asm’ or ‘__attribute__’ before ‘*’ token
/home/reon/vbox/include/iprt/types.h:677: error: expected ‘=’, ‘,’, ‘;’, ‘asm’ or ‘__attribute__’ before ‘*’ token
/home/reon/vbox/include/iprt/types.h:681: error: expected ‘=’, ‘,’, ‘;’, ‘asm’ or ‘__attribute__’ before ‘RTGCINTPTR’
/home/reon/vbox/include/iprt/types.h:688: error: expected ‘=’, ‘,’, ‘;’, ‘asm’ or ‘__attribute__’ before ‘*’ token
/home/reon/vbox/include/iprt/types.h:690: error: expected ‘=’, ‘,’, ‘;’, ‘asm’ or ‘__attribute__’ before ‘*’ token
/home/reon/vbox/include/iprt/types.h:694: error: expected ‘=’, ‘,’, ‘;’, ‘asm’ or ‘__attribute__’ before ‘RTGCUINTPTR’
/home/reon/vbox/include/iprt/types.h:701: error: expected ‘=’, ‘,’, ‘;’, ‘asm’ or ‘__attribute__’ before ‘*’ token
/home/reon/vbox/include/iprt/types.h:703: error: expected ‘=’, ‘,’, ‘;’, ‘asm’ or ‘__attribute__’ before ‘*’ token
/home/reon/vbox/include/iprt/types.h:706: error: expected ‘=’, ‘,’, ‘;’, ‘asm’ or ‘__attribute__’ before ‘RTGCPHYS’
/home/reon/vbox/include/iprt/types.h:708: error: expected ‘=’, ‘,’, ‘;’, ‘asm’ or ‘__attribute__’ before ‘*’ token
/home/reon/vbox/include/iprt/types.h:710: error: expected ‘=’, ‘,’, ‘;’, ‘asm’ or ‘__attribute__’ before ‘*’ token
/home/reon/vbox/include/iprt/types.h:726: error: expected ‘=’, ‘,’, ‘;’, ‘asm’ or ‘__attribute__’ before ‘RTGCPTR’
/home/reon/vbox/include/iprt/types.h:729: error: expected ‘=’, ‘,’, ‘;’, ‘asm’ or ‘__attribute__’ before ‘*’ token
/home/reon/vbox/include/iprt/types.h:731: error: expected ‘=’, ‘,’, ‘;’, ‘asm’ or ‘__attribute__’ before ‘*’ token
/home/reon/vbox/include/iprt/types.h:740: error: expected ‘=’, ‘,’, ‘;’, ‘asm’ or ‘__attribute__’ before ‘RTGCUINTREG’
/home/reon/vbox/include/iprt/types.h:747: error: expected ‘=’, ‘,’, ‘;’, ‘asm’ or ‘__attribute__’ before ‘*’ token
/home/reon/vbox/include/iprt/types.h:749: error: expected ‘=’, ‘,’, ‘;’, ‘asm’ or ‘__attribute__’ before ‘*’ token
/home/reon/vbox/include/iprt/types.h:763: error: expected ‘=’, ‘,’, ‘;’, ‘asm’ or ‘__attribute__’ before ‘RTCCPHYS’
/home/reon/vbox/include/iprt/types.h:766: error: expected ‘=’, ‘,’, ‘;’, ‘asm’ or ‘__attribute__’ before ‘*’ token
/home/reon/vbox/include/iprt/types.h:768: error: expected ‘=’, ‘,’, ‘;’, ‘asm’ or ‘__attribute__’ before ‘*’ token
/home/reon/vbox/include/iprt/types.h:784: error: expected ‘=’, ‘,’, ‘;’, ‘asm’ or ‘__attribute__’ before ‘RTCCUINTREG’
/home/reon/vbox/include/iprt/types.h:789: error: expected ‘=’, ‘,’, ‘;’, ‘asm’ or ‘__attribute__’ before ‘*’ token
/home/reon/vbox/include/iprt/types.h:791: error: expected ‘=’, ‘,’, ‘;’, ‘asm’ or ‘__attribute__’ before ‘*’ token
/home/reon/vbox/include/iprt/types.h:794: error: expected ‘=’, ‘,’, ‘;’, ‘asm’ or ‘__attribute__’ before ‘RTUINTREG’
/home/reon/vbox/include/iprt/types.h:796: error: expected ‘=’, ‘,’, ‘;’, ‘asm’ or ‘__attribute__’ before ‘*’ token
/home/reon/vbox/include/iprt/types.h:798: error: expected ‘=’, ‘,’, ‘;’, ‘asm’ or ‘__attribute__’ before ‘*’ token
/home/reon/vbox/include/iprt/types.h:804: error: expected ‘=’, ‘,’, ‘;’, ‘asm’ or ‘__attribute__’ before ‘RTFILE’
/home/reon/vbox/include/iprt/types.h:806: error: expected ‘=’, ‘,’, ‘;’, ‘asm’ or ‘__attribute__’ before ‘*’ token
/home/reon/vbox/include/iprt/types.h:825: error: expected ‘=’, ‘,’, ‘;’, ‘asm’ or ‘__attribute__’ before ‘RTNATIVETHREAD’
/home/reon/vbox/include/iprt/types.h:827: error: expected ‘=’, ‘,’, ‘;’, ‘asm’ or ‘__attribute__’ before ‘*’ token
/home/reon/vbox/include/iprt/types.h:832: error: expected ‘=’, ‘,’, ‘;’, ‘asm’ or ‘__attribute__’ before ‘RTPROCESS’
/home/reon/vbox/include/iprt/types.h:834: error: expected ‘=’, ‘,’, ‘;’, ‘asm’ or ‘__attribute__’ before ‘*’ token
/home/reon/vbox/include/iprt/types.h:839: error: expected ‘=’, ‘,’, ‘;’, ‘asm’ or ‘__attribute__’ before ‘RTR0PROCESS’
/home/reon/vbox/include/iprt/types.h:841: error: expected ‘=’, ‘,’, ‘;’, ‘asm’ or ‘__attribute__’ before ‘*’ token
/home/reon/vbox/include/iprt/types.h:920: error: expected specifier-qualifier-list before ‘uint8_t’
/home/reon/vbox/include/iprt/types.h:960: error: expected ‘=’, ‘,’, ‘;’, ‘asm’ or ‘__attribute__’ before ‘RTUNICP’
/home/reon/vbox/include/iprt/types.h:962: error: expected ‘=’, ‘,’, ‘;’, ‘asm’ or ‘__attribute__’ before ‘*’ token
/home/reon/vbox/include/iprt/types.h:964: error: expected ‘=’, ‘,’, ‘;’, ‘asm’ or ‘__attribute__’ before ‘*’ token
/home/reon/vbox/include/iprt/types.h:975: error: expected ‘=’, ‘,’, ‘;’, ‘asm’ or ‘__attribute__’ before ‘RTUTF16’
/home/reon/vbox/include/iprt/types.h:977: error: expected ‘=’, ‘,’, ‘;’, ‘asm’ or ‘__attribute__’ before ‘*’ token
/home/reon/vbox/include/iprt/types.h:979: error: expected ‘=’, ‘,’, ‘;’, ‘asm’ or ‘__attribute__’ before ‘*’ token
/home/reon/vbox/include/iprt/types.h:986: error: expected ‘=’, ‘,’, ‘;’, ‘asm’ or ‘__attribute__’ before ‘RTUCS2’
/home/reon/vbox/include/iprt/types.h:990: error: expected ‘=’, ‘,’, ‘;’, ‘asm’ or ‘__attribute__’ before ‘PRTUCS2’
/home/reon/vbox/include/iprt/types.h:994: error: expected ‘=’, ‘,’, ‘;’, ‘asm’ or ‘__attribute__’ before ‘PCRTUCS2’
In file included from /home/reon/vbox/src/VBox/Runtime/misc/sanity-c.c:24:
/home/reon/vbox/src/VBox/Runtime/misc/sanity.h:58: error: ‘RTHCINT’ undeclared here (not in a function)
/home/reon/vbox/src/VBox/Runtime/misc/sanity.h:59: error: ‘RTHCUINT’ undeclared here (not in a function)
/home/reon/vbox/src/VBox/Runtime/misc/sanity.h:60: error: ‘RTHCINTPTR’ undeclared here (not in a function)
/home/reon/vbox/src/VBox/Runtime/misc/sanity.h:61: error: ‘RTHCUINTPTR’ undeclared here (not in a function)
/home/reon/vbox/src/VBox/Runtime/misc/sanity.h:63: error: ‘RTHCUINTREG’ undeclared here (not in a function)
/home/reon/vbox/src/VBox/Runtime/misc/sanity.h:67: error: ‘RTR0INTPTR’ undeclared here (not in a function)
/home/reon/vbox/src/VBox/Runtime/misc/sanity.h:68: error: ‘RTR0UINTPTR’ undeclared here (not in a function)
/home/reon/vbox/src/VBox/Runtime/misc/sanity.h:72: error: ‘RTR3INTPTR’ undeclared here (not in a function)
/home/reon/vbox/src/VBox/Runtime/misc/sanity.h:73: error: ‘RTR3UINTPTR’ undeclared here (not in a function)
/home/reon/vbox/src/VBox/Runtime/misc/sanity.h:74: error: ‘RTUINTPTR’ undeclared here (not in a function)
/home/reon/vbox/src/VBox/Runtime/misc/sanity.h:78: error: ‘RTCCUINTREG’ undeclared here (not in a function)
/home/reon/vbox/src/VBox/Runtime/misc/sanity.h:111: error: ‘RTHCPHYS’ undeclared here (not in a function)
/home/reon/vbox/src/VBox/Runtime/misc/sanity.h:133: error: ‘RTGCINT’ undeclared here (not in a function)
/home/reon/vbox/src/VBox/Runtime/misc/sanity.h:134: error: ‘RTGCUINT’ undeclared here (not in a function)
/home/reon/vbox/src/VBox/Runtime/misc/sanity.h:135: error: ‘RTGCINTPTR’ undeclared here (not in a function)
/home/reon/vbox/src/VBox/Runtime/misc/sanity.h:136: error: ‘RTGCUINTPTR’ undeclared here (not in a function)
/home/reon/vbox/src/VBox/Runtime/misc/sanity.h:138: error: ‘RTGCUINTREG’ undeclared here (not in a function)
/home/reon/vbox/src/VBox/Runtime/misc/sanity.h:147: error: ‘RTGCPHYS’ undeclared here (not in a function)
kmk[3]: *** [/home/reon/vbox/out/linux.amd64/release/obj/src/VBox/Runtime/RuntimeR0Drv/misc/sanity-c.o] Error 1
The failing command:
@gcc -c -O2 -nostdinc -iwithprefix include -Wall -Wstrict-prototypes -Wno-trigraphs -Wno-pointer-sign -fno-stack-protector -O2 -fno-omit-frame-pointer -fno-strict-aliasing -fno-common -m64 -mno-red-zone -mcmodel=kernel -mno-sse -mno-mmx -mno-sse2 -mno-3dnow -fno-reorder-blocks -ffreestanding -fno-asynchronous-unwind-tables -funit-at-a-time -Wno-sign-compare -Wdeclaration-after-statement -Ir0drv/linux -I/usr/src/linux/include -I/home/reon/vbox/include -I/home/reon/vbox/src/VBox/Runtime -I/home/reon/vbox/out/linux.amd64/release -Iinclude -DVBOX -DVBOX_OSE -D__LINUX__ -D_FILE_OFFSET_BITS=64 -D__AMD64__ -D__KERNEL__ -DMODULE -DIN_RING0 -DIN_RT_R0 -DIN_RT_R0 -DRT_WITH_VBOX -DRT_WITHOUT_NOCRT_WRAPPERS -DMODULE -DKBUILD_MODNAME=KBUILD_STR\(vboxdrv\) -DKBUILD_BASENAME=KBUILD_STR\(vboxdrv\) -DIN_SUP_R0 -Wp,-MD,/home/reon/vbox/out/linux.amd64/release/obj/src/VBox/Runtime/RuntimeR0Drv/misc/sanity-c.o.dep -Wp,-MT,/home/reon/vbox/out/linux.amd64/release/obj/src/VBox/Runtime/RuntimeR0Drv/misc/sanity-c.o -Wp,-MP -o /home/reon/vbox/out/linux.amd64/release/obj/src/VBox/Runtime/RuntimeR0Drv/misc/sanity-c.o /home/reon/vbox/src/VBox/Runtime/misc/sanity-c.c
kmk[3]: Leaving directory `/home/reon/vbox/src/VBox/Runtime'
kmk[2]: *** [pass_libraries_before] Error 2
kmk[2]: Leaving directory `/home/reon/vbox/src/VBox'
kmk[1]: *** [pass_libraries_before] Error 2
kmk[1]: Leaving directory `/home/reon/vbox/src'
kmk: *** [pass_libraries_before] Error 2