rendered paste bodye all-recursive
make[1]: Entering directory `/var/tmp/portage/sys-fs/sysfsutils-1.3.0-r1/work/sysfsutils-1.3.0'
Making all in lib
make[2]: Entering directory `/var/tmp/portage/sys-fs/sysfsutils-1.3.0-r1/work/sysfsutils-1.3.0/lib'
source='sysfs_utils.c' object='libsysfs_la-sysfs_utils.lo' libtool=yes \
depfile='.deps/libsysfs_la-sysfs_utils.Plo' tmpdepfile='.deps/libsysfs_la-sysfs_utils.TPlo' \
depmode=gcc3 /bin/sh ../depcomp \
/bin/sh ../libtool --mode=compile i686-pc-linux-gnu-gcc -DHAVE_CONFIG_H -I. -I. -I.. -I../include -Wall -W -Wshadow -Wstrict-prototypes -Wmissing-prototypes -Wmissing-declarations -Wredundan$
source='sysfs_dir.c' object='libsysfs_la-sysfs_dir.lo' libtool=yes \
depfile='.deps/libsysfs_la-sysfs_dir.Plo' tmpdepfile='.deps/libsysfs_la-sysfs_dir.TPlo' \
depmode=gcc3 /bin/sh ../depcomp \
/bin/sh ../libtool --mode=compile i686-pc-linux-gnu-gcc -DHAVE_CONFIG_H -I. -I. -I.. -I../include -Wall -W -Wshadow -Wstrict-prototypes -Wmissing-prototypes -Wmissing-declarations -Wredundan$
mkdir .libs
i686-pc-linux-gnu-gcc -DHAVE_CONFIG_H -I. -I. -I.. -I../include -Wall -W -Wshadow -Wstrict-prototypes -Wmissing-prototypes -Wmissing-declarations -Wredundant-decls -02 -pipe -march=pentium-m -fomit-fr$
rm -f .libs/libsysfs_la-sysfs_dir.lo
i686-pc-linux-gnu-gcc -DHAVE_CONFIG_H -I. -I. -I.. -I../include -Wall -W -Wshadow -Wstrict-prototypes -Wmissing-prototypes -Wmissing-declarations -Wredundant-decls -02 -pipe -march=pentium-m -fomit-fr$
i686-pc-linux-gnu-gcc: unrecognized option '-02'
i686-pc-linux-gnu-gcc: unrecognized option '-02'
mv -f libsysfs_la-sysfs_utils.o .libs/libsysfs_la-sysfs_utils.lo
mv: cannot stat `libsysfs_la-sysfs_utils.o': No such file or directory
make[2]: *** [libsysfs_la-sysfs_utils.lo] Error 1
make[2]: *** Waiting for unfinished jobs....
i686-pc-linux-gnu-gcc: unrecognized option '-02'
i686-pc-linux-gnu-gcc: unrecognized option '-02'
mv -f libsysfs_la-sysfs_dir.o .libs/libsysfs_la-sysfs_dir.lo
mv: cannot stat `libsysfs_la-sysfs_dir.o': No such file or directory
make[2]: *** [libsysfs_la-sysfs_dir.lo] Error 1
make[2]: Leaving directory `/var/tmp/portage/sys-fs/sysfsutils-1.3.0-r1/work/sysfsutils-1.3.0/lib'
make[1]: *** [all-recursive] Error 1
make[1]: Leaving directory `/var/tmp/portage/sys-fs/sysfsutils-1.3.0-r1/work/sysfsutils-1.3.0'
make: *** [all] Error 2
!!! ERROR: sys-fs/sysfsutils-1.3.0-r1 failed.
Call stack:
ebuild.sh, line 1614: Called dyn_compile
ebuild.sh, line 971: Called qa_call 'src_compile'
environment, line 2083: Called src_compile
ebuild.sh, line 645: Called die
!!! emake failed
!!! If you need support, post the topmost build error, and the call stack if relevant.
!!! A complete build log is located at '/var/log/portage/sys-fs:sysfsutils-1.3.0-r1:20070327-043456.log'.