All pastes #411058 Raw Edit

Unnamed

public text v1 · immutable
#411058 ·published 2007-03-26 20:43 UTC
rendered paste body
./configure --with-ldap=/usr  \
--prefix=/usr/local --sysconfdir=/etc/httpd-main \
--mandir=/usr/share/man --enable-authn-dbm --enable-authn-anon \
--enable-authn-dbd  --enable-ssl \
--enable-file-cache --enable-cache \
--enable-disk-cache --enable-mem-cache  --enable-dbd   --enable-echo \
--enable-example   --enable-case-filter --enable-case-filter-in \
--enable-ext-filter --enable-deflate  --enable-charset-lite \
--enable-log-forensic  --enable-logio  --enable-mime-magic --enable-headers \
--enable-ident  --enable-usertrack --enable-unique-id --enable-proxy \
--enable-proxy-connect --enable-proxy-ftp --enable-proxy-http \
--enable-proxy-ajp   --enable-static-support \
--enable-static-htpasswd --enable-http --enable-dav  --enable-cgi \
--enable-cgid --enable-dav-fs   --enable-vhost-alias  --enable-imagemap  \
--enable-speling --enable-rewrite --enable-so --with-pcre=/usr --with-z=/usr \
--with-program-name=ee_httpd_server  --enable-mods-shared="ldap authnz_ldap all" 

------- Errors -------

mod_authnz_ldap.c:40:2: #error mod_authnz_ldap requires APR-util to have LDAP support built in. To fix add --with-ldap to ./configure.
mod_authnz_ldap.c:62: error: syntax error before "deref_options"
mod_authnz_ldap.c:62: warning: no semicolon at end of struct or union
mod_authnz_ldap.c:76: error: syntax error before '}' token
mod_authnz_ldap.c:76: warning: data definition has no type or storage class
mod_authnz_ldap.c:92: error: syntax error before '*' token
mod_authnz_ldap.c:92: warning: data definition has no type or storage class
mod_authnz_ldap.c:93: error: syntax error before '*' token
mod_authnz_ldap.c:93: warning: data definition has no type or storage class
mod_authnz_ldap.c:94: error: syntax error before '*' token
mod_authnz_ldap.c:94: warning: data definition has no type or storage class
mod_authnz_ldap.c:95: error: syntax error before '*' token
mod_authnz_ldap.c:95: warning: data definition has no type or storage class
mod_authnz_ldap.c:96: error: syntax error before '*' token
mod_authnz_ldap.c:96: warning: data definition has no type or storage class
mod_authnz_ldap.c:97: error: syntax error before '*' token
mod_authnz_ldap.c:97: warning: data definition has no type or storage class
mod_authnz_ldap.c:98: error: syntax error before '*' token
mod_authnz_ldap.c:98: warning: data definition has no type or storage class
mod_authnz_ldap.c:177: error: syntax error before "authn_ldap_config_t"
mod_authnz_ldap.c: In function `authn_ldap_build_filter':
mod_authnz_ldap.c:186: error: `sent_user' undeclared (first use in this function)
mod_authnz_ldap.c:186: error: (Each undeclared identifier is reported only once
mod_authnz_ldap.c:186: error: for each function it appears in.)
mod_authnz_ldap.c:187: error: `r' undeclared (first use in this function)
mod_authnz_ldap.c:192: error: `sent_filter' undeclared (first use in this function)
mod_authnz_ldap.c:196: error: `sec' undeclared (first use in this function)
mod_authnz_ldap.c:217: error: `filtbuf' undeclared (first use in this function)
mod_authnz_ldap.c: In function `create_authnz_ldap_dir_config':
mod_authnz_ldap.c:277: error: `sec' undeclared (first use in this function)
mod_authnz_ldap.c:278: error: syntax error before ')' token
mod_authnz_ldap.c:295: error: `always' undeclared (first use in this function)
mod_authnz_ldap.c: In function `authnz_ldap_cleanup_connection_close':
mod_authnz_ldap.c:313: error: `util_ldap_connection_t' undeclared (first use in this function)
mod_authnz_ldap.c:313: error: `ldc' undeclared (first use in this function)
mod_authnz_ldap.c:314: error: called object is not a function
mod_authnz_ldap.c: In function `authn_ldap_check_password':
mod_authnz_ldap.c:335: error: `sec' undeclared (first use in this function)
mod_authnz_ldap.c:336: error: syntax error before ')' token
mod_authnz_ldap.c:338: error: `util_ldap_connection_t' undeclared (first use in this function)
mod_authnz_ldap.c:338: error: `ldc' undeclared (first use in this function)
mod_authnz_ldap.c:365: error: called object is not a function
mod_authnz_ldap.c:380: error: called object is not a function
mod_authnz_ldap.c:387: error: called object is not a function
mod_authnz_ldap.c:396: error: called object is not a function
mod_authnz_ldap.c:397: error: called object is not a function
mod_authnz_ldap.c:400: error: `LDAP_SERVER_DOWN' undeclared (first use in this function)
mod_authnz_ldap.c:407: error: `LDAP_SUCCESS' undeclared (first use in this function)
mod_authnz_ldap.c:413: error: `LDAP_NO_SUCH_OBJECT' undeclared (first use in this function)
mod_authnz_ldap.c: In function `authz_ldap_check_user_access':
mod_authnz_ldap.c:472: error: `sec' undeclared (first use in this function)
mod_authnz_ldap.c:473: error: syntax error before ')' token
mod_authnz_ldap.c:475: error: `util_ldap_connection_t' undeclared (first use in this function)
mod_authnz_ldap.c:475: error: `ldc' undeclared (first use in this function)
mod_authnz_ldap.c:503: error: called object is not a function
mod_authnz_ldap.c:560: error: called object is not a function
mod_authnz_ldap.c:563: error: `LDAP_SUCCESS' undeclared (first use in this function)
mod_authnz_ldap.c:599: error: called object is not a function
mod_authnz_ldap.c:601: error: `LDAP_COMPARE_TRUE' undeclared (first use in this function)
mod_authnz_ldap.c:619: error: called object is not a function
mod_authnz_ldap.c:645: error: called object is not a function
mod_authnz_ldap.c:694: error: called object is not a function
mod_authnz_ldap.c:728: error: called object is not a function
mod_authnz_ldap.c:765: error: called object is not a function
mod_authnz_ldap.c:773: error: called object is not a function
mod_authnz_ldap.c:784: error: `LDAP_FILTER_ERROR' undeclared (first use in this function)
mod_authnz_ldap.c: In function `mod_auth_ldap_parse_url':
mod_authnz_ldap.c:835: error: `apr_ldap_url_desc_t' undeclared (first use in this function)
mod_authnz_ldap.c:835: error: `urld' undeclared (first use in this function)
mod_authnz_ldap.c:836: error: `apr_ldap_err_t' undeclared (first use in this function)
mod_authnz_ldap.c:836: error: `result' undeclared (first use in this function)
mod_authnz_ldap.c:838: error: `sec' undeclared (first use in this function)
mod_authnz_ldap.c:859: error: `LDAP_SCOPE_SUBTREE' undeclared (first use in this function)
mod_authnz_ldap.c:860: error: `LDAP_SCOPE_BASE' undeclared (first use in this function)
mod_authnz_ldap.c:861: error: `LDAP_SCOPE_ONELEVEL' undeclared (first use in this function)
mod_authnz_ldap.c:916: error: `APR_LDAP_NONE' undeclared (first use in this function)
mod_authnz_ldap.c:919: error: `APR_LDAP_SSL' undeclared (first use in this function)
mod_authnz_ldap.c:922: error: `APR_LDAP_STARTTLS' undeclared (first use in this function)
mod_authnz_ldap.c:935: error: `LDAPS_PORT' undeclared (first use in this function)
mod_authnz_ldap.c:941: error: `LDAP_PORT' undeclared (first use in this function)
mod_authnz_ldap.c: In function `mod_auth_ldap_set_deref':
mod_authnz_ldap.c:953: error: `sec' undeclared (first use in this function)
mod_authnz_ldap.c:956: error: `never' undeclared (first use in this function)
mod_authnz_ldap.c:959: error: `searching' undeclared (first use in this function)
mod_authnz_ldap.c:962: error: `finding' undeclared (first use in this function)
mod_authnz_ldap.c:965: error: `always' undeclared (first use in this function)
mod_authnz_ldap.c: In function `mod_auth_ldap_add_group_attribute':
mod_authnz_ldap.c:977: error: `sec' undeclared (first use in this function)
mod_authnz_ldap.c: At top level:
mod_authnz_ldap.c:1021: error: syntax error before ')' token
mod_authnz_ldap.c:1021: error: initializer element is not constant
mod_authnz_ldap.c:1021: error: (near initialization for `authnz_ldap_cmds[1].cmd_data')
mod_authnz_ldap.c:1021: error: initializer element is not constant
mod_authnz_ldap.c:1021: error: (near initialization for `authnz_ldap_cmds[1]')
mod_authnz_ldap.c:1025: error: initializer element is not constant
mod_authnz_ldap.c:1025: error: (near initialization for `authnz_ldap_cmds[2].func')
mod_authnz_ldap.c:1025: error: syntax error before ')' token
mod_authnz_ldap.c:1025: error: initializer element is not constant
mod_authnz_ldap.c:1025: error: (near initialization for `authnz_ldap_cmds[2].cmd_data')
mod_authnz_ldap.c:1025: error: initializer element is not constant
mod_authnz_ldap.c:1025: error: (near initialization for `authnz_ldap_cmds[2]')
mod_authnz_ldap.c:1029: error: initializer element is not constant
mod_authnz_ldap.c:1029: error: (near initialization for `authnz_ldap_cmds[3].func')
mod_authnz_ldap.c:1029: error: syntax error before ')' token
mod_authnz_ldap.c:1029: error: initializer element is not constant
mod_authnz_ldap.c:1029: error: (near initialization for `authnz_ldap_cmds[3].cmd_data')
mod_authnz_ldap.c:1029: error: initializer element is not constant
mod_authnz_ldap.c:1029: error: (near initialization for `authnz_ldap_cmds[3]')
mod_authnz_ldap.c:1035: error: initializer element is not constant
mod_authnz_ldap.c:1035: error: (near initialization for `authnz_ldap_cmds[4].func')
mod_authnz_ldap.c:1035: error: syntax error before ')' token
mod_authnz_ldap.c:1035: error: initializer element is not constant
mod_authnz_ldap.c:1035: error: (near initialization for `authnz_ldap_cmds[4].cmd_data')
mod_authnz_ldap.c:1035: error: initializer element is not constant
mod_authnz_ldap.c:1035: error: (near initialization for `authnz_ldap_cmds[4]')
mod_authnz_ldap.c:1040: error: initializer element is not constant
mod_authnz_ldap.c:1040: error: (near initialization for `authnz_ldap_cmds[5].func')
mod_authnz_ldap.c:1040: error: syntax error before ')' token
mod_authnz_ldap.c:1040: error: initializer element is not constant
mod_authnz_ldap.c:1040: error: (near initialization for `authnz_ldap_cmds[5].cmd_data')
mod_authnz_ldap.c:1040: error: initializer element is not constant
mod_authnz_ldap.c:1040: error: (near initialization for `authnz_ldap_cmds[5]')
mod_authnz_ldap.c:1047: error: initializer element is not constant
mod_authnz_ldap.c:1047: error: (near initialization for `authnz_ldap_cmds[6].func')
mod_authnz_ldap.c:1047: error: initializer element is not constant
mod_authnz_ldap.c:1047: error: (near initialization for `authnz_ldap_cmds[6]')
mod_authnz_ldap.c:1051: error: initializer element is not constant
mod_authnz_ldap.c:1051: error: (near initialization for `authnz_ldap_cmds[7].func')
mod_authnz_ldap.c:1051: error: syntax error before ')' token
mod_authnz_ldap.c:1051: error: initializer element is not constant
mod_authnz_ldap.c:1051: error: (near initialization for `authnz_ldap_cmds[7].cmd_data')
mod_authnz_ldap.c:1051: error: initializer element is not constant
mod_authnz_ldap.c:1051: error: (near initialization for `authnz_ldap_cmds[7]')
mod_authnz_ldap.c:1057: error: initializer element is not constant
mod_authnz_ldap.c:1057: error: (near initialization for `authnz_ldap_cmds[8].func')
mod_authnz_ldap.c:1057: error: initializer element is not constant
mod_authnz_ldap.c:1057: error: (near initialization for `authnz_ldap_cmds[8]')
mod_authnz_ldap.c:1068: error: initializer element is not constant
mod_authnz_ldap.c:1068: error: (near initialization for `authnz_ldap_cmds[9].func')
mod_authnz_ldap.c:1068: error: initializer element is not constant
mod_authnz_ldap.c:1068: error: (near initialization for `authnz_ldap_cmds[9]')
mod_authnz_ldap.c:1072: error: initializer element is not constant
mod_authnz_ldap.c:1072: error: (near initialization for `authnz_ldap_cmds[10]')
mod_authnz_ldap.c: In function `ImportULDAPOptFn':
mod_authnz_ldap.c:1165: error: `apr_OFN_uldap_connection_close_t' undeclared (first use in this function)
mod_authnz_ldap.c:1165: error: syntax error before ')' token
mod_authnz_ldap.c:1166: error: `apr_OFN_uldap_connection_find_t' undeclared (first use in this function)
mod_authnz_ldap.c:1166: error: syntax error before ')' token
mod_authnz_ldap.c:1167: error: `apr_OFN_uldap_cache_comparedn_t' undeclared (first use in this function)
mod_authnz_ldap.c:1167: error: syntax error before ')' token
mod_authnz_ldap.c:1168: error: `apr_OFN_uldap_cache_compare_t' undeclared (first use in this function)
mod_authnz_ldap.c:1168: error: syntax error before ')' token
mod_authnz_ldap.c:1169: error: `apr_OFN_uldap_cache_checkuserid_t' undeclared (first use in this function)
mod_authnz_ldap.c:1169: error: syntax error before ')' token
mod_authnz_ldap.c:1170: error: `apr_OFN_uldap_cache_getuserdn_t' undeclared (first use in this function)
mod_authnz_ldap.c:1170: error: syntax error before ')' token
mod_authnz_ldap.c:1171: error: `apr_OFN_uldap_ssl_supported_t' undeclared (first use in this function)
mod_authnz_ldap.c:1171: error: syntax error before ')' token
make[4]: *** [mod_authnz_ldap.slo] Error 1
make[4]: Leaving directory `/home/reinosos/httpd-2.2.0/modules/aaa'
make[3]: *** [shared-build-recursive] Error 1
make[3]: Leaving directory `/home/reinosos/httpd-2.2.0/modules/aaa'
make[2]: *** [shared-build-recursive] Error 1
make[2]: Leaving directory `/home/reinosos/httpd-2.2.0/modules'
make[1]: *** [shared-build-recursive] Error 1
make[1]: Leaving directory `/home/reinosos/httpd-2.2.0'
make: *** [all-recursive] Error 1

----- Errors ----