Compiling ==> 'constraint.c'
In file included from source/blender/blenkernel/intern/constraint.c:62:
source/blender/blenkernel/BKE_particle.h:114: warning: 'struct MTFace' declared inside parameter list
source/blender/blenkernel/BKE_particle.h:114: warning: its scope is only this definition or declaration, which is probably not what you want
source/blender/blenkernel/BKE_particle.h:182: warning: 'struct MTFace' declared inside parameter list
source/blender/blenkernel/BKE_particle.h:182: warning: 'struct MFace' declared inside parameter list
source/blender/blenkernel/BKE_particle.h:182: warning: 'struct MVert' declared inside parameter list
In file included from source/blender/blenkernel/intern/constraint.c:62:
source/blender/blenkernel/BKE_particle.h:238:7: warning: no newline at end of file
source/blender/blenkernel/intern/constraint.c: In function 'get_constraint_target_matrix':
source/blender/blenkernel/intern/constraint.c:1132: error: 'struct bMinMaxConstraint' has no member named 'tar_psys'
source/blender/blenkernel/intern/constraint.c:1132: error: 'struct bMinMaxConstraint' has no member named 'tar_psys'
source/blender/blenkernel/intern/constraint.c:1133: error: 'struct bMinMaxConstraint' has no member named 'tar_psys'
source/blender/blenkernel/intern/constraint.c:1134: error: 'struct bMinMaxConstraint' has no member named 'tar_particle'
source/blender/blenkernel/intern/constraint.c:1136: error: 'LOCPARTPATH' undeclared (first use in this function)
source/blender/blenkernel/intern/constraint.c:1136: error: (Each undeclared identifier is reported only once
source/blender/blenkernel/intern/constraint.c:1136: error: for each function it appears in.)
source/blender/blenkernel/intern/constraint.c:1137: error: 'struct bMinMaxConstraint' has no member named 'tar_path'
source/blender/blenkernel/intern/constraint.c:1140: error: 'struct bMinMaxConstraint' has no member named 'tar_particle'
source/blender/blenkernel/intern/constraint.c:1161: error: 'ROTPARTPATH' undeclared (first use in this function)
scons: *** [/home/basse/cvs/jahka/build/linux2/source/blender/blenkernel/intern/constraint.o] Error 1
scons: building terminated because of errors.
basse@kone:~/cvs/jahka/jahkablender$