All pastes #408486 Raw Edit

Stuff

public text v1 · immutable
#408486 ·published 2007-03-24 21:43 UTC
rendered paste body
g++ -g -O2 -Wall -Woverloaded-virtual -c -DREMOTE_KBD -DLIRC_DEVICE=\"/dev/lircd\" -DRCU_DEVICE=\"/dev/ttyS1\" -D_GNU_SOURCE -DVIDEODIR=\"/video\" -DPLUGINDIR=\"./PLUGINS/lib\"  timers.c
g++ -g -O2 -Wall -Woverloaded-virtual -c -DREMOTE_KBD -DLIRC_DEVICE=\"/dev/lircd\" -DRCU_DEVICE=\"/dev/ttyS1\" -D_GNU_SOURCE -DVIDEODIR=\"/video\" -DPLUGINDIR=\"./PLUGINS/lib\"  tools.c
tools.c:18:21: error: jpeglib.h: Aucun fichier ou répertoire de ce type
tools.c:677: error: variable or field ‘JpegCompressInitDestination’ declared void
tools.c:677: error: ‘j_compress_ptr’ was not declared in this scope
tools.c:678: error: expected ‘,’ or ‘;’ before ‘{’ token
tools.c:686: error: ‘boolean’ does not name a type
tools.c:702: error: variable or field ‘JpegCompressTermDestination’ declared void
tools.c:702: error: ‘j_compress_ptr’ was not declared in this scope
tools.c:703: error: expected ‘,’ or ‘;’ before ‘{’ token
tools.c: In function ‘uchar* RgbToJpeg(uchar*, int, int, int&, int)’:
tools.c:721: error: ‘jpeg_destination_mgr’ was not declared in this scope
tools.c:721: error: expected `;' before ‘jdm’
tools.c:723: error: ‘jdm’ was not declared in this scope
tools.c:724: error: ‘JpegCompressEmptyOutputBuffer’ was not declared in this scope
tools.c:727: error: aggregate ‘jpeg_compress_struct cinfo’ has incomplete type and cannot be defined
tools.c:728: error: aggregate ‘jpeg_error_mgr jerr’ has incomplete type and cannot be defined
tools.c:729: error: ‘jpeg_std_error’ was not declared in this scope
tools.c:730: error: ‘jpeg_create_compress’ was not declared in this scope
tools.c:737: error: ‘JCS_RGB’ was not declared in this scope
tools.c:739: error: ‘jpeg_set_defaults’ was not declared in this scope
tools.c:740: error: ‘jpeg_set_quality’ was not declared in this scope
tools.c:741: error: ‘jpeg_start_compress’ was not declared in this scope
tools.c:744: error: ‘JSAMPROW’ was not declared in this scope
tools.c:744: error: expected `;' before ‘rp’
tools.c:746: error: ‘rp’ was not declared in this scope
tools.c:747: error: ‘rp’ was not declared in this scope
tools.c:747: error: ‘jpeg_write_scanlines’ was not declared in this scope
tools.c:748: error: ‘jpeg_finish_compress’ was not declared in this scope
tools.c:749: error: ‘jpeg_destroy_compress’ was not declared in this scope
make: *** [tools.o] Erreur 1