All pastes #408342 Raw Edit

gappy

public cpp v1 · immutable
#408342 ·published 2007-03-24 19:30 UTC
rendered paste body
dirk@aschenputtel ~/k/trunk> make package/orinoco-compile V=99 > orinoco.textIn file included from include/asm/cpu-info.h:15,                 from include/asm/cpu-features.h:14,                 from include/asm/bitops.h:17,                 from include/linux/bitops.h:9,                 from include/linux/thread_info.h:20,                 from include/linux/preempt.h:9,                 from include/linux/spinlock.h:49,                 from include/linux/capability.h:45,                 from include/linux/sched.h:46,                 from include/linux/module.h:9,                 from /home/dirk/kamikaze2/trunk/build_mipsel/linux-2.6-brcm/orinoco-usb-0.2.2/orinoco.c:79:include/asm/cache.h:12:21: kmalloc.h: No such file or directoryIn file included from include/asm/bitops.h:17,                 from include/linux/bitops.h:9,                 from include/linux/thread_info.h:20,                 from include/linux/preempt.h:9,                 from include/linux/spinlock.h:49,                 from include/linux/capability.h:45,                 from include/linux/sched.h:46,                 from include/linux/module.h:9,                 from /home/dirk/kamikaze2/trunk/build_mipsel/linux-2.6-brcm/orinoco-usb-0.2.2/orinoco.c:79:include/asm/cpu-features.h:15:35: cpu-feature-overrides.h: No such file or directoryIn file included from include/asm/system.h:18,                 from include/asm/processor.h:22,                 from include/asm/thread_info.h:15,                 from include/linux/thread_info.h:21,                 from include/linux/preempt.h:9,                 from include/linux/spinlock.h:49,                 from include/linux/capability.h:45,                 from include/linux/sched.h:46,                 from include/linux/module.h:9,                 from /home/dirk/kamikaze2/trunk/build_mipsel/linux-2.6-brcm/orinoco-usb-0.2.2/orinoco.c:79:include/asm/addrspace.h:13:20: spaces.h: No such file or directoryIn file included from include/linux/timex.h:187,                 from include/linux/sched.h:50,                 from include/linux/module.h:9,                 from /home/dirk/kamikaze2/trunk/build_mipsel/linux-2.6-brcm/orinoco-usb-0.2.2/orinoco.c:79:include/asm/timex.h:36:19: timex.h: No such file or directoryIn file included from include/linux/sched.h:51,                 from include/linux/module.h:9,                 from /home/dirk/kamikaze2/trunk/build_mipsel/linux-2.6-brcm/orinoco-usb-0.2.2/orinoco.c:79:include/linux/jiffies.h:225:31: division by zero in #ifinclude/linux/jiffies.h:225:31: division by zero in #ifinclude/linux/jiffies.h:225:31: division by zero in #ifinclude/linux/jiffies.h:225:31: division by zero in #ifinclude/linux/jiffies.h:225:31: division by zero in #ifinclude/linux/jiffies.h:225:31: division by zero in #ifinclude/linux/jiffies.h:225:31: division by zero in #ifinclude/linux/jiffies.h:225:31: division by zero in #ifinclude/linux/jiffies.h:225:31: division by zero in #ifinclude/linux/jiffies.h:225:31: division by zero in #ifinclude/linux/jiffies.h:225:31: division by zero in #ifinclude/linux/jiffies.h:225:31: division by zero in #ifinclude/linux/jiffies.h:225:31: division by zero in #ifinclude/linux/jiffies.h:225:31: division by zero in #ifinclude/linux/jiffies.h:225:31: division by zero in #ifIn file included from include/linux/sched.h:51,                 from include/linux/module.h:9,                 from /home/dirk/kamikaze2/trunk/build_mipsel/linux-2.6-brcm/orinoco-usb-0.2.2/orinoco.c:79:include/linux/jiffies.h: In function `timespec_to_jiffies':include/linux/jiffies.h:330: error: `CLOCK_TICK_RATE' undeclared (first use in this function)include/linux/jiffies.h:330: error: (Each undeclared identifier is reported only onceinclude/linux/jiffies.h:330: error: for each function it appears in.)include/linux/jiffies.h: In function `jiffies_to_timespec':include/linux/jiffies.h:349: error: `CLOCK_TICK_RATE' undeclared (first use in this function)include/linux/jiffies.h: In function `timeval_to_jiffies':include/linux/jiffies.h:371: error: `CLOCK_TICK_RATE' undeclared (first use in this function)include/linux/jiffies.h: In function `jiffies_to_timeval':include/linux/jiffies.h:387: error: `CLOCK_TICK_RATE' undeclared (first use in this function)include/linux/jiffies.h:400:6: division by zero in #ifinclude/linux/jiffies.h:400:6: division by zero in #ifinclude/linux/jiffies.h:400:6: division by zero in #ifinclude/linux/jiffies.h:400:6: division by zero in #ifinclude/linux/jiffies.h:400:6: division by zero in #ifinclude/linux/jiffies.h:400:6: division by zero in #ifinclude/linux/jiffies.h:400:6: division by zero in #ifinclude/linux/jiffies.h:400:6: division by zero in #ifinclude/linux/jiffies.h:400:6: division by zero in #ifinclude/linux/jiffies.h:400:6: division by zero in #ifinclude/linux/jiffies.h:400:6: division by zero in #ifinclude/linux/jiffies.h:400:6: division by zero in #ifinclude/linux/jiffies.h:400:6: division by zero in #ifinclude/linux/jiffies.h:400:6: division by zero in #ifinclude/linux/jiffies.h:400:6: division by zero in #ifinclude/linux/jiffies.h:431:6: division by zero in #ifinclude/linux/jiffies.h:431:6: division by zero in #ifinclude/linux/jiffies.h:431:6: division by zero in #ifinclude/linux/jiffies.h:431:6: division by zero in #ifinclude/linux/jiffies.h:431:6: division by zero in #ifinclude/linux/jiffies.h:431:6: division by zero in #ifinclude/linux/jiffies.h:431:6: division by zero in #ifinclude/linux/jiffies.h:431:6: division by zero in #ifinclude/linux/jiffies.h:431:6: division by zero in #ifinclude/linux/jiffies.h:431:6: division by zero in #ifinclude/linux/jiffies.h:431:6: division by zero in #ifinclude/linux/jiffies.h:431:6: division by zero in #ifinclude/linux/jiffies.h:431:6: division by zero in #ifinclude/linux/jiffies.h:431:6: division by zero in #ifinclude/linux/jiffies.h:431:6: division by zero in #ifIn file included from include/linux/topology.h:34,                 from include/linux/mmzone.h:465,                 from include/linux/gfp.h:4,                 from include/linux/slab.h:14,                 from include/linux/percpu.h:5,                 from include/linux/rcupdate.h:41,                 from include/linux/pid.h:4,                 from include/linux/sched.h:72,                 from include/linux/module.h:9,                 from /home/dirk/kamikaze2/trunk/build_mipsel/linux-2.6-brcm/orinoco-usb-0.2.2/orinoco.c:79:include/asm/topology.h:1:22: topology.h: No such file or directoryIn file included from include/asm/pgtable.h:18,                 from include/linux/mm.h:40,                 from include/linux/skbuff.h:25,                 from include/linux/if_ether.h:111,                 from include/linux/netdevice.h:29,                 from /home/dirk/kamikaze2/trunk/build_mipsel/linux-2.6-brcm/orinoco-usb-0.2.2/orinoco.c:82:include/asm/io.h:28:21: ioremap.h: No such file or directoryinclude/asm/io.h:29:25: mangle-port.h: No such file or directoryIn file included from include/asm/pgtable.h:18,                 from include/linux/mm.h:40,                 from include/linux/skbuff.h:25,                 from include/linux/if_ether.h:111,                 from include/linux/netdevice.h:29,                 from /home/dirk/kamikaze2/trunk/build_mipsel/linux-2.6-brcm/orinoco-usb-0.2.2/orinoco.c:82:include/asm/io.h: In function `virt_to_phys':include/asm/io.h:118: error: `PAGE_OFFSET' undeclared (first use in this function)include/asm/io.h: In function `phys_to_virt':include/asm/io.h:135: error: `PAGE_OFFSET' undeclared (first use in this function)include/asm/io.h: In function `isa_virt_to_bus':include/asm/io.h:143: error: `PAGE_OFFSET' undeclared (first use in this function)include/asm/io.h: In function `isa_bus_to_virt':include/asm/io.h:148: error: `PAGE_OFFSET' undeclared (first use in this function)include/asm/io.h: In function `__ioremap_mode':include/asm/io.h:183: error: `UNCAC_BASE' undeclared (first use in this function)include/asm/io.h:190: error: `IO_BASE' undeclared (first use in this function)In file included from include/linux/skbuff.h:25,                 from include/linux/if_ether.h:111,                 from include/linux/netdevice.h:29,                 from /home/dirk/kamikaze2/trunk/build_mipsel/linux-2.6-brcm/orinoco-usb-0.2.2/orinoco.c:82:include/linux/mm.h: In function `lowmem_page_address':include/linux/mm.h:501: error: `PAGE_OFFSET' undeclared (first use in this function)In file included from include/linux/irq.h:22,                 from include/asm/hardirq.h:14,                 from include/linux/hardirq.h:7,                 from include/linux/interrupt.h:11,                 from include/linux/netdevice.h:563,                 from /home/dirk/kamikaze2/trunk/build_mipsel/linux-2.6-brcm/orinoco-usb-0.2.2/orinoco.c:82:include/asm/irq.h:16:17: irq.h: No such file or directoryIn file included from include/asm/hardirq.h:14,                 from include/linux/hardirq.h:7,                 from include/linux/interrupt.h:11,                 from include/linux/netdevice.h:563,                 from /home/dirk/kamikaze2/trunk/build_mipsel/linux-2.6-brcm/orinoco-usb-0.2.2/orinoco.c:82:include/linux/irq.h: At top level:include/linux/irq.h:174: error: `NR_IRQS' undeclared here (not in a function)make[5]: *** [/home/dirk/kamikaze2/trunk/build_mipsel/linux-2.6-brcm/orinoco-usb-0.2.2/orinoco.o] Error 1make[4]: *** [_module_/home/dirk/kamikaze2/trunk/build_mipsel/linux-2.6-brcm/orinoco-usb-0.2.2] Error 2make[3]: *** [modules] Error 2make[2]: *** [/home/dirk/kamikaze2/trunk/build_mipsel/linux-2.6-brcm/orinoco-usb-0.2.2/.built] Error 2make[1]: *** [orinoco-compile] Error 2make: *** [package/orinoco-compile] Fehler 2