rendered paste body/builds/n2100-uclibc/tmp/work/gcc-cross-4.1.1-r11/gcc-4.1.1/build.x86_64-linux.arm-linux-uclibcgnueabi/./gcc/xgcc -shared-libgcc -B/builds/n2100-uclibc/tmp/work/gcc-cross-4.1.1-r11/gcc-4.1.1/build.x86_64-linux.arm-linux-uclibcgnueabi/./gcc -nostdinc++ -L/builds/n2100-uclibc/tmp/work/gcc-cross-4.1.1-r11/gcc-4.1.1/build.x86_64-linux.arm-linux-uclibcgnueabi/arm-linux-uclibcgnueabi/libstdc++-v3/src -L/builds/n2100-uclibc/tmp/work/gcc-cross-4.1.1-r11/gcc-4.1.1/build.x86_64-linux.arm-linux-uclibcgnueabi/arm-linux-uclibcgnueabi/libstdc++-v3/src/.libs -B/builds/n2100-uclibc/tmp/cross/arm-linux-uclibcgnueabi/bin/ -B/builds/n2100-uclibc/tmp/cross/arm-linux-uclibcgnueabi/lib/ -isystem /builds/n2100-uclibc/tmp/cross/arm-linux-uclibcgnueabi/include -isystem /builds/n2100-uclibc/tmp/cross/arm-linux-uclibcgnueabi/sys-include -I/builds/n2100-uclibc/tmp/work/gcc-cross-4.1.1-r11/gcc-4.1.1/build.x86_64-linux.arm-linux-uclibcgnueabi/arm-linux-uclibcgnueabi/libstdc++-v3/include/arm-linux-uclibcgnueabi -I/builds/n2100-uclibc/tmp/work/gcc-cross-4.1.1-r11/gcc-4.1.1/build.x86_64-linux.arm-linux-uclibcgnueabi/arm-linux-uclibcgnueabi/libstdc++-v3/include -I/builds/n2100-uclibc/tmp/work/gcc-cross-4.1.1-r11/gcc-4.1.1/libstdc++-v3/libsupc++ -g -Os -fno-implicit-templates -Wall -Wextra -Wwrite-strings -Wcast-qual -fdiagnostics-show-location=once -ffunction-sections -fdata-sections -c monetary_members.cc -fPIC -DPIC -o .libs/monetary_members.o
monetary_members.cc: In member function 'void std::moneypunct<_CharT, _Intl>::_M_initialize_moneypunct(int*, const char*) [with _CharT = wchar_t, bool _Intl = true]':
monetary_members.cc:409: error: '__global_locale' was not declared in this scope
monetary_members.cc: In member function 'void std::moneypunct<_CharT, _Intl>::_M_initialize_moneypunct(int*, const char*) [with _CharT = wchar_t, bool _Intl = false]':
monetary_members.cc:564: error: '__global_locale' was not declared in this scope
make[4]: *** [monetary_members.lo] Error 1
make[4]: Leaving directory `/builds/n2100-uclibc/tmp/work/gcc-cross-4.1.1-r11/gcc-4.1.1/build.x86_64-linux.arm-linux-uclibcgnueabi/arm-linux-uclibcgnueabi/libstdc++-v3/src'
make[3]: *** [all-recursive] Error 1
make[3]: Leaving directory `/builds/n2100-uclibc/tmp/work/gcc-cross-4.1.1-r11/gcc-4.1.1/build.x86_64-linux.arm-linux-uclibcgnueabi/arm-linux-uclibcgnueabi/libstdc++-v3'
make[2]: *** [all] Error 2
make[2]: Leaving directory `/builds/n2100-uclibc/tmp/work/gcc-cross-4.1.1-r11/gcc-4.1.1/build.x86_64-linux.arm-linux-uclibcgnueabi/arm-linux-uclibcgnueabi/libstdc++-v3'
make[1]: *** [all-target-libstdc++-v3] Error 2
make[1]: Leaving directory `/builds/n2100-uclibc/tmp/work/gcc-cross-4.1.1-r11/gcc-4.1.1/build.x86_64-linux.arm-linux-uclibcgnueabi'
make: *** [all] Error 2
FATAL: oe_runmake failed