All pastes #408061 Raw Edit

Stuff

public text v1 · immutable
#408061 ·published 2007-03-24 15:32 UTC
rendered paste body
/usr/local/bin/libtool  --mode=compile c++ -DHAVE_CONFIG_H -I. -I. -I.. -I..    -O2 -pipe  -W -Wall -Wwrite-strings -Wcast-qual -Werror -Wpointer-arith -Wcast-align -Wstrict-prototypes -Woverloaded-virtual -ftemplate-depth-25 -pipe -c -o mfea_proto_comm.lo `test -f mfea_proto_comm.cc || echo './'`mfea_proto_comm.cc
 c++ -DHAVE_CONFIG_H -I. -I. -I.. -I.. -O2 -pipe -W -Wall -Wwrite-strings -Wcast-qual -Werror -Wpointer-arith -Wcast-align -Wstrict-prototypes -Woverloaded-virtual -ftemplate-depth-25 -pipe -c mfea_proto_comm.cc -MT mfea_proto_comm.lo -MD -MP -MF .deps/mfea_proto_comm.TPlo  -fPIC -DPIC -o .libs/mfea_proto_comm.o
mfea_proto_comm.cc: In member function `void
   ProtoComm::proto_socket_read(XorpFd, IoEventType)':
mfea_proto_comm.cc:1490: warning: cast from `char*' to `cmsghdr*' increases
   required alignment of target type
mfea_proto_comm.cc:1585: warning: cast from `char*' to `cmsghdr*' increases
   required alignment of target type
mfea_proto_comm.cc: In member function `int
   ProtoComm::proto_socket_write(unsigned int, const IPvX&, const IPvX&, int,
   int, bool, const uint8_t*, long unsigned int, std::string&)':
mfea_proto_comm.cc:2184: warning: cast from `char*' to `cmsghdr*' increases
   required alignment of target type
mfea_proto_comm.cc:2243: warning: cast from `char*' to `cmsghdr*' increases
   required alignment of target type
mfea_proto_comm.cc:2254: warning: cast from `char*' to `cmsghdr*' increases
   required alignment of target type
mfea_proto_comm.cc:2265: warning: cast from `char*' to `cmsghdr*' increases
   required alignment of target type
gmake[3]: *** [mfea_proto_comm.lo] Error 1
gmake[3]: Leaving directory `/usr/ports/net/xorp/w-xorp-1.4/xorp-1.4/fea'
gmake[2]: *** [all-recursive] Error 1
gmake[2]: Leaving directory `/usr/ports/net/xorp/w-xorp-1.4/xorp-1.4/fea'
gmake[1]: *** [all-recursive] Error 1
gmake[1]: Leaving directory `/usr/ports/net/xorp/w-xorp-1.4/xorp-1.4'
gmake: *** [all] Error 2
*** Error code 2