cc1: warnings being treated as errors
gui.c: In function 'on_btn_auth_mechs_clicked':
gui.c:324: warning: assignment makes pointer from integer without a cast
make[2]: *** [gui.lo] Error 1
make[2]: Leaving directory `/var/tmp/portage/app-pda/multisync-0.83_pre20050414-r4/work/multisync/plugins/ldap_plugin/src'
make[1]: *** [all-recursive] Error 1
make[1]: Leaving directory `/var/tmp/portage/app-pda/multisync-0.83_pre20050414-r4/work/multisync/plugins/ldap_plugin'
make: *** [all] Error 2
!!! ERROR: app-pda/multisync-0.83_pre20050414-r4 failed.
Call stack:
ebuild.sh, line 1614: Called dyn_compile
ebuild.sh, line 971: Called qa_call 'src_compile'
environment, line 4068: Called src_compile
multisync-0.83_pre20050414-r4.ebuild, line 118: Called run_compile
multisync-0.83_pre20050414-r4.ebuild, line 93: Called die
!!! Failed during make!
!!! If you need support, post the topmost build error, and the call stack if relevant.
!!! A complete build log is located at '/var/tmp/portage/app-pda/multisync-0.83_pre20050414-r4/temp/build.log'.