All pastes #407323 Raw Edit

Stuff

public text v1 · immutable
#407323 ·published 2007-03-23 22:34 UTC
rendered paste body
>>> Unpacking source...
>>> Unpacking kadu-20070316.tar.bz2 to /home/gentoo/tmpdir/portage/net-im/kadu-notify-0.6.0_pre20070316/work
 [32;01m*[0m Processing file notify/notification.h...
>>> Source unpacked.
>>> Compiling source in /home/gentoo/tmpdir/portage/net-im/kadu-notify-0.6.0_pre20070316/work/kadu-notify ...

[32m>>>[0m Compiling notify module ...
    [LDFLAGS="  ", CXXFLAGS="  -I /usr/include/kadu -I /usr/include/kadu/modules"]

make[1]: Wejcie do katalogu `/home/gentoo/tmpdir/portage/net-im/kadu-notify-0.6.0_pre20070316/work/kadu-notify'
generating notify/notify_moc.cpp
generating notify/notify_slots_moc.cpp
generating notify/notification_moc.cpp
make[1]: Opuszczenie katalogu `/home/gentoo/tmpdir/portage/net-im/kadu-notify-0.6.0_pre20070316/work/kadu-notify'
make[1]: Wejcie do katalogu `/home/gentoo/tmpdir/portage/net-im/kadu-notify-0.6.0_pre20070316/work/kadu-notify'
generating dependency file for notify/notification_moc.cpp
generating dependency file for notify/notify_slots_moc.cpp
In file included from /usr/include/kadu/chat.h:12,
                 from /usr/include/kadu/kadu-headers.h:4,
                 from <command line>:1:
/usr/include/kadu/gadu.h:7:21: error: libgadu.h: Nie ma takiego pliku ani katalogu
In file included from /usr/include/kadu/chat.h:12,
                 from /usr/include/kadu/kadu-headers.h:4,
                 from <command line>:1:
/usr/include/kadu/gadu.h:7:21: error: libgadu.h: Nie ma takiego pliku ani katalogu
generating dependency file for notify/notify_moc.cpp
generating dependency file for notify/notification.cpp
In file included from /usr/include/kadu/chat.h:12,
                 from /usr/include/kadu/kadu-headers.h:4,
                 from <command line>:1:
/usr/include/kadu/gadu.h:7:21: error: libgadu.h: Nie ma takiego pliku ani katalogu
In file included from /usr/include/kadu/chat.h:12,
                 from /usr/include/kadu/kadu-headers.h:4,
                 from <command line>:1:
/usr/include/kadu/gadu.h:7:21: error: libgadu.h: Nie ma takiego pliku ani katalogu
generating dependency file for notify/notify_slots.cpp
generating dependency file for notify/notify.cpp
In file included from /usr/include/kadu/chat.h:12,
                 from /usr/include/kadu/kadu-headers.h:4,
                 from <command line>:1:
/usr/include/kadu/gadu.h:7:21: error: libgadu.h: Nie ma takiego pliku ani katalogu
In file included from /usr/include/kadu/chat.h:12,
                 from /usr/include/kadu/kadu-headers.h:4,
                 from <command line>:1:
/usr/include/kadu/gadu.h:7:21: error: libgadu.h: Nie ma takiego pliku ani katalogu
make[1]: Opuszczenie katalogu `/home/gentoo/tmpdir/portage/net-im/kadu-notify-0.6.0_pre20070316/work/kadu-notify'
make[1]: Wejcie do katalogu `/home/gentoo/tmpdir/portage/net-im/kadu-notify-0.6.0_pre20070316/work/kadu-notify'
compiling file notify/notify.cpp
compiling file notify/notify_slots.cpp
In file included from /usr/include/kadu/chat.h:12,
                 from /usr/include/kadu/kadu-headers.h:4,
                 from <command line>:1:
/usr/include/kadu/gadu.h:7:21: error: libgadu.h: Nie ma takiego pliku ani katalogu
In file included from /usr/include/kadu/chat.h:12,
                 from /usr/include/kadu/kadu-headers.h:4,
                 from <command line>:1:
/usr/include/kadu/gadu.h:7:21: error: libgadu.h: Nie ma takiego pliku ani katalogu
/usr/include/kadu/gadu.h:13: error: uin_t does not name a type
/usr/include/kadu/gadu.h:22: error: UinType was not declared in this scope
/usr/include/kadu/gadu.h:22: error: template argument 1 is invalid
/usr/include/kadu/gadu.h:33: error: expected `)' before uin
/usr/include/kadu/gadu.h:202: error: UinType does not name a type
/usr/include/kadu/gadu.h:233: error: field LoginParams has incomplete type
/usr/include/kadu/gadu.h:235: error: ISO C++ forbids declaration of gg_session with no type
/usr/include/kadu/gadu.h:235: error: expected ; before * token
/usr/include/kadu/gadu.h:462: error: UinType has not been declared
/usr/include/kadu/gadu.h:468: error: UinType has not been declared
/usr/include/kadu/gadu.h:486: error: gg_pubdir50_t has not been declared
/usr/include/kadu/gadu.h:574: error: uin_t has not been declared
/usr/include/kadu/gadu.h:746: error: UinType has not been declared
/usr/include/kadu/gadu.h:756: error: UinType has not been declared
/usr/include/kadu/gadu.h:768: error: UinType has not been declared
/usr/include/kadu/gadu.h:858: error: UinType has not been declared
/usr/include/kadu/gadu.h:863: error: UinType has not been declared
/usr/include/kadu/gadu.h:864: error: UinType has not been declared
/usr/include/kadu/gadu.h:864: error: UinType has not been declared
/usr/include/kadu/gadu.h:865: error: UinType has not been declared
/usr/include/kadu/gadu.h:865: error: UinType has not been declared
/usr/include/kadu/gadu.h:866: error: UinType has not been declared
/usr/include/kadu/gadu.h:866: error: UinType has not been declared
/usr/include/kadu/gadu.h:889: error: UinType has not been declared
/usr/include/kadu/gadu.h:894: error: UinType has not been declared
/usr/include/kadu/gadu.h:899: error: UinType has not been declared
/usr/include/kadu/gadu.h:904: error: UinType has not been declared
/usr/include/kadu/gadu.h:909: error: UinType has not been declared
/usr/include/kadu/gadu.h:914: error: UinType has not been declared
/usr/include/kadu/gadu.h:918: error: UinType has not been declared
/usr/include/kadu/gadu.h:933: error: UinType has not been declared
/usr/include/kadu/gadu.h:942: error: UinType has not been declared
/usr/include/kadu/gadu.h:948: error: UinType has not been declared
/usr/include/kadu/gadu.h:979: error: UinType has not been declared
/usr/include/kadu/gadu.h:13: error: uin_t does not name a type
/usr/include/kadu/gadu.h:22: error: UinType was not declared in this scope
/usr/include/kadu/gadu.h:22: error: template argument 1 is invalid
/usr/include/kadu/gadu.h:33: error: expected `)' before uin
/usr/include/kadu/gadu.h:202: error: UinType does not name a type
/usr/include/kadu/gadu.h:233: error: field LoginParams has incomplete type
/usr/include/kadu/gadu.h:235: error: ISO C++ forbids declaration of gg_session with no type
/usr/include/kadu/gadu.h:235: error: expected ; before * token
/usr/include/kadu/gadu.h:462: error: UinType has not been declared
/usr/include/kadu/gadu.h:468: error: UinType has not been declared
/usr/include/kadu/gadu.h:486: error: gg_pubdir50_t has not been declared
/usr/include/kadu/gadu.h:574: error: uin_t has not been declared
/usr/include/kadu/gadu.h:746: error: UinType has not been declared
/usr/include/kadu/gadu.h:756: error: UinType has not been declared
/usr/include/kadu/gadu.h:768: error: UinType has not been declared
/usr/include/kadu/gadu.h:858: error: UinType has not been declared
/usr/include/kadu/gadu.h:863: error: UinType has not been declared
/usr/include/kadu/gadu.h:864: error: UinType has not been declared
/usr/include/kadu/gadu.h:864: error: UinType has not been declared
/usr/include/kadu/gadu.h:865: error: UinType has not been declared
/usr/include/kadu/gadu.h:865: error: UinType has not been declared
/usr/include/kadu/gadu.h:866: error: UinType has not been declared
/usr/include/kadu/gadu.h:866: error: UinType has not been declared
/usr/include/kadu/gadu.h:889: error: UinType has not been declared
/usr/include/kadu/gadu.h:894: error: UinType has not been declared
/usr/include/kadu/gadu.h:899: error: UinType has not been declared
/usr/include/kadu/gadu.h:904: error: UinType has not been declared
/usr/include/kadu/gadu.h:909: error: UinType has not been declared
/usr/include/kadu/gadu.h:914: error: UinType has not been declared
/usr/include/kadu/gadu.h:918: error: UinType has not been declared
/usr/include/kadu/gadu.h:933: error: UinType has not been declared
/usr/include/kadu/gadu.h:942: error: UinType has not been declared
/usr/include/kadu/gadu.h:948: error: UinType has not been declared
/usr/include/kadu/gadu.h:979: error: UinType has not been declared
/usr/include/kadu/chat.h:134: error: UinType has not been declared
/usr/include/kadu/chat.h:409: error: UinType has not been declared
/usr/include/kadu/chat.h:418: error: UinType has not been declared
/usr/include/kadu/chat.h:426: error: UinType has not been declared
/usr/include/kadu/chat.h:434: error: UinType has not been declared
/usr/include/kadu/chat.h:134: error: UinType has not been declared
/usr/include/kadu/chat.h:409: error: UinType has not been declared
/usr/include/kadu/chat.h:418: error: UinType has not been declared
/usr/include/kadu/chat.h:426: error: UinType has not been declared
/usr/include/kadu/chat.h:434: error: UinType has not been declared
/usr/include/kadu/gadu-private.h:119: error: uin_t has not been declared
/usr/include/kadu/gadu-private.h:130: error: UinType has not been declared
/usr/include/kadu/gadu-private.h:131: error: UinType has not been declared
/usr/include/kadu/gadu-private.h:133: error: gg_pubdir50_t has not been declared
/usr/include/kadu/gadu_images_manager.h:39: error: UinType has not been declared
/usr/include/kadu/gadu_images_manager.h:42: error: UinType has not been declared
/usr/include/kadu/gadu_images_manager.h:55: error: UinType has not been declared
/usr/include/kadu/gadu_images_manager.h:64: error: UinType has not been declared
/usr/include/kadu/gadu_rich_text.h:7: error: UinType has not been declared
/usr/include/kadu/gadu-private.h:119: error: uin_t has not been declared
/usr/include/kadu/gadu-private.h:130: error: UinType has not been declared
/usr/include/kadu/gadu-private.h:131: error: UinType has not been declared
/usr/include/kadu/gadu-private.h:133: error: gg_pubdir50_t has not been declared
/usr/include/kadu/gadu_images_manager.h:39: error: UinType has not been declared
/usr/include/kadu/gadu_images_manager.h:42: error: UinType has not been declared
/usr/include/kadu/gadu_images_manager.h:55: error: UinType has not been declared
/usr/include/kadu/gadu_images_manager.h:64: error: UinType has not been declared
/usr/include/kadu/gadu_rich_text.h:7: error: UinType has not been declared
/usr/include/kadu/history.h:31: error: UinType does not name a type
/usr/include/kadu/history.h:91: error: UinType was not declared in this scope
/usr/include/kadu/history.h:91: error: template argument 1 is invalid
/usr/include/kadu/history.h:94: error: UinType has not been declared
/usr/include/kadu/history.h:97: error: UinType has not been declared
/usr/include/kadu/history.h:108: error: UinType has not been declared
/usr/include/kadu/history.h:111: error: UinType has not been declared
/usr/include/kadu/history.h:31: error: UinType does not name a type
/usr/include/kadu/history.h:91: error: UinType was not declared in this scope
/usr/include/kadu/history.h:91: error: template argument 1 is invalid
/usr/include/kadu/history.h:94: error: UinType has not been declared
/usr/include/kadu/history.h:97: error: UinType has not been declared
/usr/include/kadu/history.h:108: error: UinType has not been declared
/usr/include/kadu/history.h:111: error: UinType has not been declared
/usr/include/kadu/kadu.h:98: error: UinType has not been declared
/usr/include/kadu/kadu.h:118: error: UinType has not been declared
/usr/include/kadu/kadu.h:98: error: UinType has not been declared
/usr/include/kadu/kadu.h:118: error: UinType has not been declared
/usr/include/kadu/search.h:36: error: UinType has not been declared
/usr/include/kadu/search.h:55: error: UinType does not name a type
/usr/include/kadu/updates.h:32: error: expected `)' before uin
/usr/include/kadu/search.h:36: error: UinType has not been declared
/usr/include/kadu/search.h:55: error: UinType does not name a type
/usr/include/kadu/updates.h:32: error: expected `)' before uin
/usr/include/kadu/userbox.h:122: error: UinType has not been declared
/usr/include/kadu/userbox.h:173: error: UinType does not name a type
/usr/include/kadu/userbox.h:122: error: UinType has not been declared
/usr/include/kadu/userbox.h:173: error: UinType does not name a type
make[1]: *** [notify/notify_slots.o] Bd 1
make[1]: *** Oczekiwanie na niezakoczone zadania....
make[1]: *** [notify/notify.o] Bd 1
make[1]: Opuszczenie katalogu `/home/gentoo/tmpdir/portage/net-im/kadu-notify-0.6.0_pre20070316/work/kadu-notify'
make: *** [module_notify] Bd 1

!!! ERROR: net-im/kadu-notify-0.6.0_pre20070316 failed.
Call stack:
  ebuild.sh, line 1614:   Called dyn_compile
  ebuild.sh, line 971:   Called qa_call 'src_compile'
  environment, line 3433:   Called src_compile
  ebuild.sh, line 1304:   Called kadu-module_src_compile
  kadu-module.eclass, line 142:   Called die

!!! Error: emake failed!
!!! If you need support, post the topmost build error, and the call stack if relevant.
!!! A complete build log is located at '/home/gentoo/tmpdir/portage/net-im/kadu-notify-0.6.0_pre20070316/temp/build.log'.