All pastes #406895 Raw Edit

LMJ

public text v1 · immutable
·published 2007-03-22 19:41 UTC
rendered paste body
QT :

make[3]: Entering directory `/TOOLCHAIN/src.qt.netstation2.20070322.190423.22294.netstation/qt-x11-free-3.3.8/plugins/src/imageformats'
cd jpeg && make -f Makefile
make[3]: Entering directory `/TOOLCHAIN/src.qt.netstation2.20070322.190423.22294.netstation/qt-x11-free-3.3.8/plugins/src/sqldrivers'
make[3]: Nothing to be done for `first'.
make[3]: Leaving directory `/TOOLCHAIN/src.qt.netstation2.20070322.190423.22294.netstation/qt-x11-free-3.3.8/plugins/src/sqldrivers'
cd styles && make -f Makefile
make[4]: Entering directory `/TOOLCHAIN/src.qt.netstation2.20070322.190423.22294.netstation/qt-x11-free-3.3.8/plugins/src/imageformats/jpeg'
g++ -c -pipe -fno-exceptions -Wall -W -O2 -D_REENTRANT -fPIC  -DQT_NO_DEBUG -DQT_THREAD_SUPPORT -DQT_PLUGIN -DQT_SHARED -I/TOOLCHAIN/src.qt.netstation2.20070322.190423.22294.netstation/qt-x11-free-3.3.8/mkspecs/linux-g++-64 -I. -I/usr/include/freetype2 -I../../../../include -I/usr/X11R7/include -I/usr/X11R7/include -I.moc/release-shared-mt/ -o .obj/release-shared-mt/main.o main.cpp
make[3]: Entering directory `/TOOLCHAIN/src.qt.netstation2.20070322.190423.22294.netstation/qt-x11-free-3.3.8/plugins/src/styles'
make[3]: Nothing to be done for `first'.
make[3]: Leaving directory `/TOOLCHAIN/src.qt.netstation2.20070322.190423.22294.netstation/qt-x11-free-3.3.8/plugins/src/styles'
cd mng && make -f Makefile
make[4]: Entering directory `/TOOLCHAIN/src.qt.netstation2.20070322.190423.22294.netstation/qt-x11-free-3.3.8/plugins/src/imageformats/mng'
g++ -c -pipe -fno-exceptions -Wall -W -O2 -D_REENTRANT -fPIC  -DQT_NO_DEBUG -DQT_THREAD_SUPPORT -DQT_PLUGIN -DQT_SHARED -I/TOOLCHAIN/src.qt.netstation2.20070322.190423.22294.netstation/qt-x11-free-3.3.8/mkspecs/linux-g++-64 -I. -I/usr/include/freetype2 -I../../../../include -I/usr/X11R7/include -I/usr/X11R7/include -I.moc/release-shared-mt/ -o .obj/release-shared-mt/main.o main.cpp
In file included from main.cpp:12:
../../../../src/kernel/qmngio.cpp:58:20: error: libmng.h: No such file or directory
../../../../src/kernel/qmngio.cpp:85: error: 'mng_ptr' has not been declared
../../../../src/kernel/qmngio.cpp:85: error: 'mng_uint32' has not been declared
../../../../src/kernel/qmngio.cpp:85: error: 'mng_uint32p' has not been declared
../../../../src/kernel/qmngio.cpp:114: error: 'mng_int32' has not been declared
../../../../src/kernel/qmngio.cpp:115: error: 'mng_int8' has not been declared
../../../../src/kernel/qmngio.cpp:116: error: 'mng_chunkid' has not been declared
../../../../src/kernel/qmngio.cpp:117: error: 'mng_uint32' has not been declared
../../../../src/kernel/qmngio.cpp:118: error: 'mng_int32' has not been declared
../../../../src/kernel/qmngio.cpp:119: error: 'mng_int32' has not been declared
../../../../src/kernel/qmngio.cpp:120: error: 'mng_pchar' has not been declared
../../../../src/kernel/qmngio.cpp:131: error: 'mng_uint32' has not been declared
../../../../src/kernel/qmngio.cpp:131: error: 'mng_uint32' has not been declared
../../../../src/kernel/qmngio.cpp:142: error: 'mng_ptr' does not name a type
../../../../src/kernel/qmngio.cpp:146: error: 'mng_bool' does not name a type
../../../../src/kernel/qmngio.cpp:154: error: 'mng_uint32' does not name a type
../../../../src/kernel/qmngio.cpp:158: error: 'mng_uint32' has not been declared
../../../../src/kernel/qmngio.cpp:173: error: 'mng_handle' does not name a type
../../../../src/kernel/qmngio.cpp: In member function 'bool QMNGFormat::readdata(int, int, int)':
../../../../src/kernel/qmngio.cpp:88: warning: comparison between signed and unsigned integer expressions
../../../../src/kernel/qmngio.cpp:91: error: invalid type argument of 'unary *'
../../../../src/kernel/qmngio.cpp:93: warning: comparison between signed and unsigned integer expressions
../../../../src/kernel/qmngio.cpp:95: error: invalid conversion from 'int' to 'void*'
../../../../src/kernel/qmngio.cpp:95: error:   initializing argument 1 of 'void* memcpy(void*, const void*, size_t)'
../../../../src/kernel/qmngio.cpp:101: error: invalid conversion from 'int' to 'void*'
../../../../src/kernel/qmngio.cpp:101: error:   initializing argument 1 of 'void* memcpy(void*, const void*, size_t)'
../../../../src/kernel/qmngio.cpp:102: error: 'mng_ptr' was not declared in this scope
../../../../src/kernel/qmngio.cpp:108: error: invalid conversion from 'int' to 'void*'
../../../../src/kernel/qmngio.cpp:108: error:   initializing argument 1 of 'void* memcpy(void*, const void*, size_t)'
../../../../src/kernel/qmngio.cpp: In member function 'bool QMNGFormat::errorproc(int, int, int, int, int, int, int)':
../../../../src/kernel/qmngio.cpp:123: error: operands to ?: have different types
../../../../src/kernel/qmngio.cpp: In member function 'bool QMNGFormat::processheader(int, int)':
../../../../src/kernel/qmngio.cpp:137: error: 'handle' was not declared in this scope
../../../../src/kernel/qmngio.cpp:139: error: 'MNG_CANVAS_BGRA8' was not declared in this scope
../../../../src/kernel/qmngio.cpp:139: error: 'MNG_CANVAS_ARGB8' was not declared in this scope
../../../../src/kernel/qmngio.cpp:139: error: 'mng_set_canvasstyle' was not declared in this scope
../../../../src/kernel/qmngio.cpp: In constructor 'QMNGFormat::QMNGFormat()':
../../../../src/kernel/qmngio.cpp:301: error: 'handle' was not declared in this scope
../../../../src/kernel/qmngio.cpp: In destructor 'virtual QMNGFormat::~QMNGFormat()':
../../../../src/kernel/qmngio.cpp:316: error: 'handle' was not declared in this scope
../../../../src/kernel/qmngio.cpp:316: error: 'mng_cleanup' was not declared in this scope
../../../../src/kernel/qmngio.cpp: At global scope:
../../../../src/kernel/qmngio.cpp:322: error: 'mng_bool' does not name a type
../../../../src/kernel/qmngio.cpp:326: error: 'mng_bool' does not name a type
../../../../src/kernel/qmngio.cpp:330: error: 'mng_bool' does not name a type
../../../../src/kernel/qmngio.cpp:334: error: 'mng_bool' does not name a type
../../../../src/kernel/qmngio.cpp:346: error: 'mng_bool' does not name a type
../../../../src/kernel/qmngio.cpp:351: error: 'mng_ptr' does not name a type
../../../../src/kernel/qmngio.cpp:355: error: 'mng_bool' does not name a type
../../../../src/kernel/qmngio.cpp:363: error: 'mng_uint32' does not name a type
../../../../src/kernel/qmngio.cpp:367: error: 'mng_bool' does not name a type
../../../../src/kernel/qmngio.cpp:372: error: 'mng_ptr' does not name a type
../../../../src/kernel/qmngio.cpp:376: error: variable or field 'memfree' declared void
../../../../src/kernel/qmngio.cpp:376: error: 'mng_ptr' was not declared in this scope
../../../../src/kernel/qmngio.cpp:376: error: 'mng_size_t' was not declared in this scope
../../../../src/kernel/qmngio.cpp:376: error: initializer expression list treated as compound expression
../../../../src/kernel/qmngio.cpp:377: error: expected ',' or ';' before '{' token
../../../../src/kernel/qmngio.cpp: In member function 'virtual int QMNGFormat::decode(QImage&, QImageConsumer*, const uchar*, int)':
../../../../src/kernel/qmngio.cpp:397: error: 'handle' was not declared in this scope
../../../../src/kernel/qmngio.cpp:397: error: 'mng_ptr' was not declared in this scope
../../../../src/kernel/qmngio.cpp:397: error: '::memalloc' has not been declared
../../../../src/kernel/qmngio.cpp:397: error: 'mng_initialize' was not declared in this scope
../../../../src/kernel/qmngio.cpp:398: error: 'MNG_TRUE' was not declared in this scope
../../../../src/kernel/qmngio.cpp:398: error: 'mng_set_suspensionmode' was not declared in this scope
../../../../src/kernel/qmngio.cpp:399: error: '::openstream' has not been declared
../../../../src/kernel/qmngio.cpp:399: error: 'mng_setcb_openstream' was not declared in this scope
../../../../src/kernel/qmngio.cpp:400: error: '::closestream' has not been declared
../../../../src/kernel/qmngio.cpp:400: error: 'mng_setcb_closestream' was not declared in this scope
../../../../src/kernel/qmngio.cpp:401: error: '::readdata' has not been declared
../../../../src/kernel/qmngio.cpp:401: error: 'mng_setcb_readdata' was not declared in this scope
../../../../src/kernel/qmngio.cpp:402: error: '::errorproc' has not been declared
../../../../src/kernel/qmngio.cpp:402: error: 'mng_setcb_errorproc' was not declared in this scope
../../../../src/kernel/qmngio.cpp:403: error: '::processheader' has not been declared
../../../../src/kernel/qmngio.cpp:403: error: 'mng_setcb_processheader' was not declared in this scope
../../../../src/kernel/qmngio.cpp:404: error: '::getcanvasline' has not been declared
../../../../src/kernel/qmngio.cpp:404: error: 'mng_setcb_getcanvasline' was not declared in this scope
../../../../src/kernel/qmngio.cpp:405: error: '::refresh' has not been declared
../../../../src/kernel/qmngio.cpp:405: error: 'mng_setcb_refresh' was not declared in this scope
../../../../src/kernel/qmngio.cpp:406: error: '::gettickcount' has not been declared
../../../../src/kernel/qmngio.cpp:406: error: 'mng_setcb_gettickcount' was not declared in this scope
../../../../src/kernel/qmngio.cpp:407: error: '::settimer' has not been declared
../../../../src/kernel/qmngio.cpp:407: error: 'mng_setcb_settimer' was not declared in this scope
../../../../src/kernel/qmngio.cpp:409: error: 'mng_readdisplay' was not declared in this scope
../../../../src/kernel/qmngio.cpp:415: error: 'handle' was not declared in this scope
../../../../src/kernel/qmngio.cpp:415: error: 'mng_display_resume' was not declared in this scope
make[4]: *** [.obj/release-shared-mt/main.o] Error 1
make[4]: Leaving directory `/TOOLCHAIN/src.qt.netstation2.20070322.190423.22294.netstation/qt-x11-free-3.3.8/plugins/src/imageformats/mng'
make[3]: *** [sub-mng] Error 2
make[3]: *** Waiting for unfinished jobs....
test -d ../../../imageformats/ || mkdir -p ../../../imageformats/
rm -f libqjpeg.so
g++ -fno-exceptions  -Wl,-rpath,//opt/qt3/lib64 -shared -Wl,-rpath,/TOOLCHAIN/src.qt.netstation2.20070322.190423.22294.netstation/qt-x11-free-3.3.8/plugins/imageformats -o libqjpeg.so .obj/release-shared-mt/main.o   -L/TOOLCHAIN/src.qt.netstation2.20070322.190423.22294.netstation/qt-x11-free-3.3.8/lib -L/usr/X11/lib64 -L/usr/X11/lib64 -ljpeg -lqt-mt -lpng -lz -lGLU -lGL -lXmu -lXrender -lXrandr -lXcursor -lXinerama -lXft -lfreetype -lfontconfig -lXext -lX11 -lm -lSM -lICE -ldl -lpthread 
mv -f libqjpeg.so ../../../imageformats/
make[4]: Leaving directory `/TOOLCHAIN/src.qt.netstation2.20070322.190423.22294.netstation/qt-x11-free-3.3.8/plugins/src/imageformats/jpeg'
make[3]: Leaving directory `/TOOLCHAIN/src.qt.netstation2.20070322.190423.22294.netstation/qt-x11-free-3.3.8/plugins/src/imageformats'
make[2]: *** [sub-imageformats] Error 2
make[2]: Leaving directory `/TOOLCHAIN/src.qt.netstation2.20070322.190423.22294.netstation/qt-x11-free-3.3.8/plugins/src'
make[1]: *** [sub-plugins] Error 2
make[1]: Leaving directory `/TOOLCHAIN/src.qt.netstation2.20070322.190423.22294.netstation/qt-x11-free-3.3.8'
make: *** [init] Error 2
Due to previous errors, no 5-qt.log file!















OGRE3D
g++ -shared -nostdlib /usr/lib64/gcc/x86_64-t2-linux-gnu/4.1.2/../../../../lib64/crti.o /usr/lib64/gcc/x86_64-t2-linux-gnu/4.1.2/crtbeginS.o  .libs/OgreGLXConfig.o .libs/OgreGLXInput.o .libs/OgreGLXTimer.o .libs/OgreGLXPlatform.o  -Wl,--rpath -Wl,/TOOLCHAIN/src.ogre3d.netstation2.20070322.191645.2885.netstation/ogrenew/OgreMain/src/.libs -Wl,--rpath -Wl,/usr/lib64/../lib64 -Wl,--rpath -Wl,/usr/lib64/../lib64 -L/usr/X11R6/lib -lX11 -lGL -lGLU /TOOLCHAIN/src.ogre3d.netstation2.20070322.191645.2885.netstation/ogrenew/OgreMain/src/.libs/libOgreMain.so -lXaw -lpthread -lz -ldl -L/usr/lib64/gcc/x86_64-t2-linux-gnu/4.1.2 -L/usr/lib64/gcc/x86_64-t2-linux-gnu/4.1.2/../../../../x86_64-t2-linux-gnu/lib -L/usr/lib64/gcc/x86_64-t2-linux-gnu/4.1.2/../../../../lib64 -L/lib/../lib64 -L/usr/lib/../lib64 /usr/lib64/../lib64/libstdc++.so -lm -lc -lgcc_s /usr/lib64/gcc/x86_64-t2-linux-gnu/4.1.2/crtendS.o /usr/lib64/gcc/x86_64-t2-linux-gnu/4.1.2/../../../../lib64/crtn.o  -Wl,-soname -Wl,libOgrePlatform.so.0 -o .libs/libOgrePlatform.so.0.0.0
/usr/lib64/gcc/x86_64-t2-linux-gnu/4.1.2/../../../../x86_64-t2-linux-gnu/bin/ld: cannot find -lX11
collect2: ld returned 1 exit status
make[3]: *** [libOgrePlatform.la] Error 1
make[3]: Leaving directory `/TOOLCHAIN/src.ogre3d.netstation2.20070322.191645.2885.netstation/ogrenew/PlatformManagers/GLX/src'
make[2]: *** [all-recursive] Error 1
make[2]: Leaving directory `/TOOLCHAIN/src.ogre3d.netstation2.20070322.191645.2885.netstation/ogrenew/PlatformManagers/GLX'
make[1]: *** [all-recursive] Error 1
make[1]: Leaving directory `/TOOLCHAIN/src.ogre3d.netstation2.20070322.191645.2885.netstation/ogrenew/PlatformManagers'
make: *** [all-recursive] Error 1
Due to previous errors, no 5-ogre3d.log file!




Rezound :

g++ -g -Wall -Wno-unused-function -Wno-unused-variable -Wno-unused -I/usr/include -I/usr/include -I/usr/include -Wl,-lpthread -o rezound main.o  ./.libs/libfrontend.a ../../src/backend/.libs/libbackend.a -L/usr/lib /usr/lib64/libFLAC++.so /usr/lib64/libFLAC.so /usr/lib64/../lib/libstdc++.so ../../src/backend/File/.libs/libFile.a ../../src/backend/Edits/.libs/libEdits.a ../../src/backend/Effects/.libs/libEffects.a ../../src/backend/Filters/.libs/libFilters.a ../../src/backend/Looping/.libs/libLooping.a ../../src/backend/Remaster/.libs/libRemaster.a ../../src/backend/Generate/.libs/libGenerate.a ../../src/backend/LADSPA/.libs/libLADSPA.a ../../src/misc/CNestedDataFile/.libs/libmiscCN.a ../../src/PoolFile/.libs/libPoolFile.a /usr/lib64/libFOX-1.6.so -L/usr/X11R7/lib64 /usr/X11R7/lib64/libXcursor.so /usr/X11R7/lib64/libXfixes.so /usr/X11R7/lib64/libXrandr.so /usr/X11R7/lib64/libXext.so /usr/X11R7/lib64/libXrender.so /usr/X11R7/lib64/libX11.so /usr/X11R7/lib64/libxcb-xlib.so /usr/X11R7/lib64/libxcb.so /usr/X11R7/lib64/libXau.so -ldl -lrt /usr/lib64/libpng12.so /usr/lib64/libtiff.so /usr/lib64/libjpeg.so -lz -lbz2 -lGLU -lGL /usr/lib64/../lib64/libstdc++.so -lpthread -lm -Wl,--rpath -Wl,/usr/lib64/../lib -Wl,--rpath -Wl,/usr/lib64/../lib64 -Wl,--rpath -Wl,/usr/X11R7/lib64 -Wl,--rpath -Wl,/usr/lib64/../lib -Wl,--rpath -Wl,/usr/lib64/../lib64 -Wl,--rpath -Wl,/usr/X11R7/lib64
/usr/lib64/gcc/x86_64-t2-linux-gnu/4.1.2/../../../../x86_64-t2-linux-gnu/bin/ld: skipping incompatible /usr/lib/libpthread.so when searching for -lpthread
/usr/lib64/gcc/x86_64-t2-linux-gnu/4.1.2/../../../../x86_64-t2-linux-gnu/bin/ld: skipping incompatible /usr/lib/libpthread.a when searching for -lpthread
/usr/lib64/../lib/libstdc++.so: could not read symbols: File in wrong format
collect2: ld returned 1 exit status