All pastes #406765 Raw Edit

Something

public text v1 · immutable
·published 2007-03-22 18:02 UTC
rendered paste body
...
-- Configuring done
-- Generating done
-- Build files have been written to: /home/kde4/build/kdereview/nepomuk-kde/kmetadata
makeobj[0]: Entering directory `/home/kde4/build/kdereview/nepomuk-kde/kmetadata'
Scanning dependencies of target kmetadata
[  1%] Building CXX object kmetadata/CMakeFiles/kmetadata.dir/variant.o
[  2%] Building CXX object kmetadata/CMakeFiles/kmetadata.dir/resourcedata.o
In file included from /home/kde4/src/kdereview/nepomuk-kde/kmetadata/kmetadata/resourcedata.cpp:15:
/home/kde4/src/kdereview/nepomuk-kde/kmetadata/kmetadata/resourcedata.h:22:36: error: knepomuk/rdf/statement.h: No such file or directory
In file included from /home/kde4/src/kdereview/nepomuk-kde/kmetadata/kmetadata/resourcedata.cpp:17:
/home/kde4/src/kdereview/nepomuk-kde/kmetadata/kmetadata/tools.h:22:31: error: knepomuk/rdf/node.h: No such file or directory
/home/kde4/src/kdereview/nepomuk-kde/kmetadata/kmetadata/resourcedata.cpp:20:31: error: knepomuk/knepomuk.h: No such file or directory
/home/kde4/src/kdereview/nepomuk-kde/kmetadata/kmetadata/resourcedata.cpp:21:45: error: knepomuk/services/rdfrepository.h: No such file or directory
/home/kde4/src/kdereview/nepomuk-kde/kmetadata/kmetadata/resourcedata.cpp:22:49: error: knepomuk/services/resourceidservice.h: No such file or directory
/home/kde4/src/kdereview/nepomuk-kde/kmetadata/kmetadata/resourcedata.cpp:23:48: error: knepomuk/rdf/statementlistiterator.h: No such file or directory
/home/kde4/src/kdereview/nepomuk-kde/kmetadata/kmetadata/resourcedata.h:196: error: ‘RDF’ has not been declared
/home/kde4/src/kdereview/nepomuk-kde/kmetadata/kmetadata/resourcedata.h:196: error: template argument 1 is invalid
/home/kde4/src/kdereview/nepomuk-kde/kmetadata/kmetadata/resourcedata.h:207: error: ‘RDF’ has not been declared
/home/kde4/src/kdereview/nepomuk-kde/kmetadata/kmetadata/resourcedata.h:207: error: template argument 1 is invalid
/home/kde4/src/kdereview/nepomuk-kde/kmetadata/kmetadata/resourcedata.h:220: error: ‘RDF’ has not been declared
/home/kde4/src/kdereview/nepomuk-kde/kmetadata/kmetadata/resourcedata.h:220: error: template argument 1 is invalid
/home/kde4/src/kdereview/nepomuk-kde/kmetadata/kmetadata/tools.h:51: error: ‘RDF’ has not been declared
/home/kde4/src/kdereview/nepomuk-kde/kmetadata/kmetadata/tools.h:51: error: template argument 1 is invalid
/home/kde4/src/kdereview/nepomuk-kde/kmetadata/kmetadata/tools.h:51: error: invalid type in declaration before ‘;’ token
/home/kde4/src/kdereview/nepomuk-kde/kmetadata/kmetadata/tools.h:52: error: ‘RDF’ has not been declared
/home/kde4/src/kdereview/nepomuk-kde/kmetadata/kmetadata/tools.h:52: error: expected initializer before ‘valueToRDFNode’
/home/kde4/src/kdereview/nepomuk-kde/kmetadata/kmetadata/tools.h:58: error: ‘RDF’ has not been declared
/home/kde4/src/kdereview/nepomuk-kde/kmetadata/kmetadata/tools.h:58: error: expected ‘,’ or ‘...’ before ‘&’ token
/home/kde4/src/kdereview/nepomuk-kde/kmetadata/kmetadata/resourcedata.cpp:30: error: ‘Services’ is not a namespace-name
/home/kde4/src/kdereview/nepomuk-kde/kmetadata/kmetadata/resourcedata.cpp:30: error: expected namespace-name before ‘;’ token
/home/kde4/src/kdereview/nepomuk-kde/kmetadata/kmetadata/resourcedata.cpp:31: error: ‘RDF’ is not a namespace-name
/home/kde4/src/kdereview/nepomuk-kde/kmetadata/kmetadata/resourcedata.cpp:31: error: expected namespace-name before ‘;’ token
/home/kde4/src/kdereview/nepomuk-kde/kmetadata/kmetadata/resourcedata.cpp: In member function ‘bool Nepomuk::KMetaData::ResourceData::exists() const’:
/home/kde4/src/kdereview/nepomuk-kde/kmetadata/kmetadata/resourcedata.cpp:242: error: ‘RDFRepository’ was not declared in this scope
/home/kde4/src/kdereview/nepomuk-kde/kmetadata/kmetadata/resourcedata.cpp:242: error: expected `;' before ‘rr’
/home/kde4/src/kdereview/nepomuk-kde/kmetadata/kmetadata/resourcedata.cpp:248: error: ‘rr’ was not declared in this scope
/home/kde4/src/kdereview/nepomuk-kde/kmetadata/kmetadata/resourcedata.cpp:248: error: ‘Node’ was not declared in this scope
/home/kde4/src/kdereview/nepomuk-kde/kmetadata/kmetadata/resourcedata.cpp:248: error: ‘Statement’ was not declared in this scope
/home/kde4/src/kdereview/nepomuk-kde/kmetadata/kmetadata/resourcedata.cpp:252: error: ‘valueToRDFNode’ is not a member of ‘Nepomuk::KMetaData’
/home/kde4/src/kdereview/nepomuk-kde/kmetadata/kmetadata/resourcedata.cpp:259: error: ‘rr’ was not declared in this scope
/home/kde4/src/kdereview/nepomuk-kde/kmetadata/kmetadata/resourcedata.cpp:259: error: ‘Node’ was not declared in this scope
/home/kde4/src/kdereview/nepomuk-kde/kmetadata/kmetadata/resourcedata.cpp:259: error: ‘Statement’ was not declared in this scope
/home/kde4/src/kdereview/nepomuk-kde/kmetadata/kmetadata/resourcedata.cpp: In member function ‘bool Nepomuk::KMetaData::ResourceData::determineUri()’:
/home/kde4/src/kdereview/nepomuk-kde/kmetadata/kmetadata/resourcedata.cpp:302: error: ‘RDFRepository’ was not declared in this scope
/home/kde4/src/kdereview/nepomuk-kde/kmetadata/kmetadata/resourcedata.cpp:302: error: expected `;' before ‘rr’
/home/kde4/src/kdereview/nepomuk-kde/kmetadata/kmetadata/resourcedata.cpp:304: error: ‘rr’ was not declared in this scope
/home/kde4/src/kdereview/nepomuk-kde/kmetadata/kmetadata/resourcedata.cpp:307: error: ‘rr’ was not declared in this scope
/home/kde4/src/kdereview/nepomuk-kde/kmetadata/kmetadata/resourcedata.cpp:307: error: ‘Node’ was not declared in this scope
/home/kde4/src/kdereview/nepomuk-kde/kmetadata/kmetadata/resourcedata.cpp:307: error: ‘Statement’ was not declared in this scope
/home/kde4/src/kdereview/nepomuk-kde/kmetadata/kmetadata/resourcedata.cpp:318: error: ‘Statement’ cannot appear in a constant-expression
/home/kde4/src/kdereview/nepomuk-kde/kmetadata/kmetadata/resourcedata.cpp:318: error: template argument 1 is invalid
/home/kde4/src/kdereview/nepomuk-kde/kmetadata/kmetadata/resourcedata.cpp:318: error: invalid type in declaration before ‘=’ token
/home/kde4/src/kdereview/nepomuk-kde/kmetadata/kmetadata/resourcedata.cpp:321: error: ‘valueToRDFNode’ is not a member of ‘Nepomuk::KMetaData’
/home/kde4/src/kdereview/nepomuk-kde/kmetadata/kmetadata/resourcedata.cpp:323: error: request for member ‘isEmpty’ in ‘sl’, which is of non-class type ‘int’
/home/kde4/src/kdereview/nepomuk-kde/kmetadata/kmetadata/resourcedata.cpp:327: error: request for member ‘first’ in ‘sl’, which is of non-class type ‘int’
/home/kde4/src/kdereview/nepomuk-kde/kmetadata/kmetadata/resourcedata.cpp: In member function ‘bool Nepomuk::KMetaData::ResourceData::load()’:
/home/kde4/src/kdereview/nepomuk-kde/kmetadata/kmetadata/resourcedata.cpp:423: error: ‘RDFRepository’ was not declared in this scope
/home/kde4/src/kdereview/nepomuk-kde/kmetadata/kmetadata/resourcedata.cpp:423: error: expected `;' before ‘rr’
/home/kde4/src/kdereview/nepomuk-kde/kmetadata/kmetadata/resourcedata.cpp:425: error: ‘StatementListIterator’ was not declared in this scope
/home/kde4/src/kdereview/nepomuk-kde/kmetadata/kmetadata/resourcedata.cpp:425: error: expected `;' before ‘it’
/home/kde4/src/kdereview/nepomuk-kde/kmetadata/kmetadata/resourcedata.cpp:429: error: ‘it’ was not declared in this scope
/home/kde4/src/kdereview/nepomuk-kde/kmetadata/kmetadata/resourcedata.cpp:430: error: expected initializer before ‘&’ token
/home/kde4/src/kdereview/nepomuk-kde/kmetadata/kmetadata/resourcedata.cpp:432: error: ‘s’ was not declared in this scope
/home/kde4/src/kdereview/nepomuk-kde/kmetadata/kmetadata/resourcedata.cpp:441: error: ‘NodeResource’ was not declared in this scope
/home/kde4/src/kdereview/nepomuk-kde/kmetadata/kmetadata/resourcedata.cpp:440: warning: unused variable ‘oldProp’
/home/kde4/src/kdereview/nepomuk-kde/kmetadata/kmetadata/resourcedata.cpp: In member function ‘bool Nepomuk::KMetaData::ResourceData::save()’:
/home/kde4/src/kdereview/nepomuk-kde/kmetadata/kmetadata/resourcedata.cpp:540: error: ‘RDFRepository’ was not declared in this scope
/home/kde4/src/kdereview/nepomuk-kde/kmetadata/kmetadata/resourcedata.cpp:540: error: expected `;' before ‘rr’
/home/kde4/src/kdereview/nepomuk-kde/kmetadata/kmetadata/resourcedata.cpp:546: error: ‘rr’ was not declared in this scope
/home/kde4/src/kdereview/nepomuk-kde/kmetadata/kmetadata/resourcedata.cpp:558: error: ‘rr’ was not declared in this scope
/home/kde4/src/kdereview/nepomuk-kde/kmetadata/kmetadata/resourcedata.cpp:558: error: ‘Node’ was not declared in this scope
/home/kde4/src/kdereview/nepomuk-kde/kmetadata/kmetadata/resourcedata.cpp:558: error: ‘Statement’ was not declared in this scope
/home/kde4/src/kdereview/nepomuk-kde/kmetadata/kmetadata/resourcedata.cpp:579: error: ‘Statement’ cannot appear in a constant-expression
/home/kde4/src/kdereview/nepomuk-kde/kmetadata/kmetadata/resourcedata.cpp:579: error: template argument 1 is invalid
/home/kde4/src/kdereview/nepomuk-kde/kmetadata/kmetadata/resourcedata.cpp:579: error: invalid type in declaration before ‘=’ token
/home/kde4/src/kdereview/nepomuk-kde/kmetadata/kmetadata/resourcedata.cpp:580: error: request for member ‘isEmpty’ in ‘sl’, which is of non-class type ‘int’
/home/kde4/src/kdereview/nepomuk-kde/kmetadata/kmetadata/resourcedata.cpp: At global scope:
/home/kde4/src/kdereview/nepomuk-kde/kmetadata/kmetadata/resourcedata.cpp:604: error: ‘Nepomuk::RDF’ has not been declared
/home/kde4/src/kdereview/nepomuk-kde/kmetadata/kmetadata/resourcedata.cpp:604: error: template argument 1 is invalid
/home/kde4/src/kdereview/nepomuk-kde/kmetadata/kmetadata/resourcedata.cpp: In member function &#8216;int Nepomuk::KMetaData::ResourceData::allStatements(QFlags<Nepomuk::KMetaData::ResourceData::Flag>, QFlags<Nepomuk::KMetaData::ResourceData::Flag>) const&#8217;:
/home/kde4/src/kdereview/nepomuk-kde/kmetadata/kmetadata/resourcedata.cpp:611: error: &#8216;Statement&#8217; was not declared in this scope
/home/kde4/src/kdereview/nepomuk-kde/kmetadata/kmetadata/resourcedata.cpp:611: error: template argument 1 is invalid
/home/kde4/src/kdereview/nepomuk-kde/kmetadata/kmetadata/resourcedata.cpp:611: error: invalid type in declaration before &#8216;;&#8217; token
/home/kde4/src/kdereview/nepomuk-kde/kmetadata/kmetadata/resourcedata.cpp:628: error: request for member &#8216;append&#8217; in &#8216;statements&#8217;, which is of non-class type &#8216;int&#8217;
/home/kde4/src/kdereview/nepomuk-kde/kmetadata/kmetadata/resourcedata.cpp:635: error: request for member &#8216;append&#8217; in &#8216;statements&#8217;, which is of non-class type &#8216;int&#8217;
/home/kde4/src/kdereview/nepomuk-kde/kmetadata/kmetadata/resourcedata.cpp:641: error: &#8216;Node&#8217; was not declared in this scope
/home/kde4/src/kdereview/nepomuk-kde/kmetadata/kmetadata/resourcedata.cpp:641: error: template argument 1 is invalid
/home/kde4/src/kdereview/nepomuk-kde/kmetadata/kmetadata/resourcedata.cpp:641: error: invalid type in declaration before &#8216;=&#8217; token
/home/kde4/src/kdereview/nepomuk-kde/kmetadata/kmetadata/resourcedata.cpp:642: error: &#8216;Node&#8217; cannot appear in a constant-expression
/home/kde4/src/kdereview/nepomuk-kde/kmetadata/kmetadata/resourcedata.cpp:642: error: template argument 1 is invalid
/home/kde4/src/kdereview/nepomuk-kde/kmetadata/kmetadata/resourcedata.cpp:642: error: expected initializer before &#8216;nIt&#8217;
/home/kde4/src/kdereview/nepomuk-kde/kmetadata/kmetadata/resourcedata.cpp:642: error: &#8216;nIt&#8217; was not declared in this scope
/home/kde4/src/kdereview/nepomuk-kde/kmetadata/kmetadata/resourcedata.cpp:642: error: request for member &#8216;constEnd&#8217; in &#8216;nl&#8217;, which is of non-class type &#8216;int&#8217;
/home/kde4/src/kdereview/nepomuk-kde/kmetadata/kmetadata/resourcedata.cpp:643: error: request for member &#8216;append&#8217; in &#8216;statements&#8217;, which is of non-class type &#8216;int&#8217;
/home/kde4/src/kdereview/nepomuk-kde/kmetadata/kmetadata/resourcedata.cpp:649: error: request for member &#8216;append&#8217; in &#8216;statements&#8217;, which is of non-class type &#8216;int&#8217;
/home/kde4/src/kdereview/nepomuk-kde/kmetadata/kmetadata/resourcedata.cpp:651: error: &#8216;valueToRDFNode&#8217; is not a member of &#8216;Nepomuk::KMetaData&#8217;
/home/kde4/qt-copy/include/QtCore/qglobal.h: At global scope:
/home/kde4/qt-copy/include/QtCore/qglobal.h: In instantiation of &#8216;QForeachContainer<int>&#8217;:
/home/kde4/src/kdereview/nepomuk-kde/kmetadata/kmetadata/resourcedata.cpp:660:   instantiated from here
/home/kde4/qt-copy/include/QtCore/qglobal.h:1689: error: &#8216;int&#8217; is not a class, struct, or union type
/home/kde4/qt-copy/include/QtCore/qglobal.h:1689: error: &#8216;int&#8217; is not a class, struct, or union type
/home/kde4/src/kdereview/nepomuk-kde/kmetadata/kmetadata/resourcedata.cpp: In member function &#8216;int Nepomuk::KMetaData::ResourceData::allStatements(QFlags<Nepomuk::KMetaData::ResourceData::Flag>, QFlags<Nepomuk::KMetaData::ResourceData::Flag>) const&#8217;:
/home/kde4/src/kdereview/nepomuk-kde/kmetadata/kmetadata/resourcedata.cpp:660: error: &#8216;class QForeachContainer<int>&#8217; has no member named &#8216;i&#8217;
/home/kde4/src/kdereview/nepomuk-kde/kmetadata/kmetadata/resourcedata.cpp:660: error: &#8216;class QForeachContainer<int>&#8217; has no member named &#8216;e&#8217;
/home/kde4/src/kdereview/nepomuk-kde/kmetadata/kmetadata/resourcedata.cpp:660: error: &#8216;class QForeachContainer<int>&#8217; has no member named &#8216;i&#8217;
/home/kde4/src/kdereview/nepomuk-kde/kmetadata/kmetadata/resourcedata.cpp:660: error: expected `;' before &#8216;s&#8217;
/home/kde4/src/kdereview/nepomuk-kde/kmetadata/kmetadata/resourcedata.cpp:661: error: &#8216;s&#8217; was not declared in this scope
/home/kde4/src/kdereview/nepomuk-kde/kmetadata/kmetadata/resourcedata.cpp: At global scope:
/home/kde4/src/kdereview/nepomuk-kde/kmetadata/kmetadata/resourcedata.cpp:667: error: &#8216;Nepomuk::RDF&#8217; has not been declared
/home/kde4/src/kdereview/nepomuk-kde/kmetadata/kmetadata/resourcedata.cpp:667: error: template argument 1 is invalid
/home/kde4/src/kdereview/nepomuk-kde/kmetadata/kmetadata/resourcedata.cpp: In member function &#8216;int Nepomuk::KMetaData::ResourceData::allStatementsToAdd() const&#8217;:
/home/kde4/src/kdereview/nepomuk-kde/kmetadata/kmetadata/resourcedata.cpp:674: error: &#8216;Statement&#8217; was not declared in this scope
/home/kde4/src/kdereview/nepomuk-kde/kmetadata/kmetadata/resourcedata.cpp:674: error: template argument 1 is invalid
/home/kde4/src/kdereview/nepomuk-kde/kmetadata/kmetadata/resourcedata.cpp:677: error: &#8216;Statement&#8217; was not declared in this scope
/home/kde4/src/kdereview/nepomuk-kde/kmetadata/kmetadata/resourcedata.cpp:677: error: template argument 1 is invalid
/home/kde4/src/kdereview/nepomuk-kde/kmetadata/kmetadata/resourcedata.cpp:677: error: invalid type in declaration before &#8216;=&#8217; token
/home/kde4/src/kdereview/nepomuk-kde/kmetadata/kmetadata/resourcedata.cpp:681: error: request for member &#8216;append&#8217; in &#8216;statements&#8217;, which is of non-class type &#8216;int&#8217;
/home/kde4/src/kdereview/nepomuk-kde/kmetadata/kmetadata/resourcedata.cpp:681: error: &#8216;Node&#8217; was not declared in this scope
/home/kde4/src/kdereview/nepomuk-kde/kmetadata/kmetadata/resourcedata.cpp: At global scope:
/home/kde4/src/kdereview/nepomuk-kde/kmetadata/kmetadata/resourcedata.cpp:690: error: &#8216;Nepomuk::RDF&#8217; has not been declared
/home/kde4/src/kdereview/nepomuk-kde/kmetadata/kmetadata/resourcedata.cpp:690: error: template argument 1 is invalid
/home/kde4/qt-copy/include/QtCore/qglobal.h: In constructor &#8216;QForeachContainer<T>::QForeachContainer(const T&) [with T = int]&#8217;:
/home/kde4/src/kdereview/nepomuk-kde/kmetadata/kmetadata/resourcedata.cpp:660:   instantiated from here
/home/kde4/qt-copy/include/QtCore/qglobal.h:1686: error: using invalid field &#8216;QForeachContainer<T>::i&#8217;
/home/kde4/qt-copy/include/QtCore/qglobal.h:1686: error: request for member &#8216;begin&#8217; in &#8216;((QForeachContainer<int>*)this)->QForeachContainer<int>::c&#8217;, which is of non-class type &#8216;const int&#8217;
/home/kde4/qt-copy/include/QtCore/qglobal.h:1686: error: using invalid field &#8216;QForeachContainer<T>::e&#8217;
/home/kde4/qt-copy/include/QtCore/qglobal.h:1686: error: request for member &#8216;end&#8217; in &#8216;((QForeachContainer<int>*)this)->QForeachContainer<int>::c&#8217;, which is of non-class type &#8216;const int&#8217;
make[2]: *** [kmetadata/CMakeFiles/kmetadata.dir/resourcedata.o] Error 1
make[1]: *** [kmetadata/CMakeFiles/kmetadata.dir/all] Error 2
make: *** [all] Error 2
makeobj[0]: Leaving directory `/home/kde4/build/kdereview/nepomuk-kde/kmetadata'