All pastes #406141 Raw Edit

Anonymous

public text v1 · immutable
·published 2007-03-22 04:23 UTC
rendered paste body
Building the vmmon module.

Using 2.6.x kernel build system.
make: se ingresa al directorio `/tmp/vmware-config1/vmmon-only'
make -C /lib/modules/2.6.20-9-generic/build/include/.. SUBDIRS=$PWD SRCROOT=$PWD/. modules
make[1]: se ingresa al directorio `/usr/src/linux-headers-2.6.20-9-generic'
  CC [M]  /tmp/vmware-config1/vmmon-only/linux/driver.o
In file included from /tmp/vmware-config1/vmmon-only/linux/driver.c:80:
/tmp/vmware-config1/vmmon-only/./include/compat_kernel.h:21: error: expected declaration specifiers or ‘...’ before ‘compat_exit’
/tmp/vmware-config1/vmmon-only/./include/compat_kernel.h:21: error: expected declaration specifiers or ‘...’ before ‘exit_code’
/tmp/vmware-config1/vmmon-only/./include/compat_kernel.h:21: warning: type defaults to ‘int’ in declaration of ‘_syscall1’
make[2]: *** [/tmp/vmware-config1/vmmon-only/linux/driver.o] Error 1
make[1]: *** [_module_/tmp/vmware-config1/vmmon-only] Error 2
make[1]: se sale del directorio `/usr/src/linux-headers-2.6.20-9-generic'
make: *** [vmmon.ko] Error 2
make: se sale del directorio `/tmp/vmware-config1/vmmon-only'
Unable to build the vmmon module.

For more information on how to troubleshoot module-related problems, please 
visit our Web site at "http://www.vmware.com/download/modules/modules.html" and
"http://www.vmware.com/support/reference/linux/prebuilt_modules_linux.html".
Execution aborted.

horohe@Tormento1:~/Desktop/vmware-server-distrib$