/pwlib/include/ptlib/unix -I/root/pwlib/include/ptlib -I/root/openh323/include h323chan.cpp -L/root/openh323/lib -lh323_linux_x86_r -L/root/pwlib/lib -lpt_linux_x86_r
h323chan.cpp:31:19: error: ptlib.h: No such file or directory
In file included from /root/openh323/include/mediafmt.h:122,
from /root/openh323/include/codecs.h:301,
from /root/openh323/include/h323caps.h:214,
from /root/openh323/include/h323con.h:339,
from /root/openh323/include/h323.h:483,
from h323chan.cpp:32:
/root/openh323/include/rtp.h:230:27: error: ptlib/sockets.h: No such file or directory
In file included from /root/openh323/include/h323.h:495,
from /root/openh323/include/gkclient.h:227,
from /root/openh323/include/h323.h:485,
from /root/openh323/include/h323ep.h:292,
from /root/openh323/include/h323.h:484,
from h323chan.cpp:32:
/root/openh323/include/h323pluginmgr.h:123:29: error: ptlib/pluginmgr.h: No such file or directory
/root/openh323/include/h323pluginmgr.h:126:28: error: ptlib/pfactory.h: No such file or directory
In file included from /root/openh323/include/h225ras.h:181,
from /root/openh323/include/gkclient.h:228,
from /root/openh323/include/h323.h:485,
from /root/openh323/include/h323ep.h:292,
from /root/openh323/include/h323.h:484,
from h323chan.cpp:32:
/root/openh323/include/h323trans.h:97:26: error: ptclib/asner.h: No such file or directory
h323chan.cpp:35:30: error: ptclib/delaychan.h: No such file or directory
In file included from h323chan.cpp:36:
/root/openh323/include/gkserver.h:352:28: error: ptlib/safecoll.h: No such file or directory
/root/openh323/include/rtp.h:264: error: expected class-name before â{â token
/root/openh323/include/rtp.h:265: error: âPBYTEArrayâ has not been declared
/root/openh323/include/rtp.h:265: error: ISO C++ forbids declaration of âPCLASSINFOâ with no type
/root/openh323/include/rtp.h:268: error: expected `)' before âpayloadSizeâ
/root/openh323/include/rtp.h:314: error: âBOOLâ does not name a type
/root/openh323/include/rtp.h:315: error: âBOOLâ has not been declared
/root/openh323/include/rtp.h:317: error: âBOOLâ does not name a type
/root/openh323/include/rtp.h:318: error: âBOOLâ has not been declared
/root/openh323/include/rtp.h:323: error: âWORDâ does not name a type
/root/openh323/include/rtp.h:324: error: âWORDâ has not been declared
/root/openh323/include/rtp.h:326: error: âDWORDâ does not name a type
/root/openh323/include/rtp.h:327: error: âDWORDâ has not been declared
/root/openh323/include/rtp.h:329: error: âDWORDâ does not name a type
/root/openh323/include/rtp.h:330: error: âDWORDâ has not been declared
/root/openh323/include/rtp.h:332: error: âPINDEXâ does not name a type
/root/openh323/include/rtp.h:333: error: âDWORDâ does not name a type
/root/openh323/include/rtp.h:334: error: âPINDEXâ has not been declared
/root/openh323/include/rtp.h:334: error: âDWORDâ has not been declared
/root/openh323/include/rtp.h:336: error: âPINDEXâ does not name a type
/root/openh323/include/rtp.h:340: error: âPINDEXâ does not name a type
/root/openh323/include/rtp.h:341: error: âBOOLâ does not name a type
/root/openh323/include/rtp.h:342: error: ISO C++ forbids declaration of âBYTEâ with no type
/root/openh323/include/rtp.h:342: error: expected â;â before â*â token
/root/openh323/include/rtp.h:344: error: âPINDEXâ does not name a type
/root/openh323/include/rtp.h:345: error: âBOOLâ does not name a type
/root/openh323/include/rtp.h:346: error: ISO C++ forbids declaration of âBYTEâ with no type
/root/openh323/include/rtp.h:346: error: expected â;â before â*â token
/root/openh323/include/rtp.h:348: error: expected `;' before âprotectedâ
/root/openh323/include/rtp.h:349: error: âPINDEXâ does not name a type
/root/openh323/include/rtp.h: In member function âunsigned int RTP_DataFrame::GetVersion() constâ:
/root/openh323/include/rtp.h:312: error: âtheArrayâ was not declared in this scope
/root/openh323/include/rtp.h: In member function âRTP_DataFrame::PayloadTypes RTP_DataFrame::GetPayloadType() constâ:
/root/openh323/include/rtp.h:320: error: âtheArrayâ was not declared in this scope
/root/openh323/include/rtp.h: In member function âvoid RTP_DataFrame::SetSequenceNumber(int)â:
/root/openh323/include/rtp.h:324: error: âPUInt16bâ was not declared in this scope
/root/openh323/include/rtp.h:324: error: expected primary-expression before â)â token
/root/openh323/include/rtp.h:324: error: âtheArrayâ was not declared in this scope
/root/openh323/include/rtp.h: In member function âvoid RTP_DataFrame::SetTimestamp(int)â:
/root/openh323/include/rtp.h:327: error: âPUInt32bâ was not declared in this scope
/root/openh323/include/rtp.h:327: error: expected primary-expression before â)â token
/root/openh323/include/rtp.h:327: error: âtheArrayâ was not declared in this scope
/root/openh323/include/rtp.h: In member function âvoid RTP_DataFrame::SetSyncSource(int)â:
/root/openh323/include/rtp.h:330: error: âPUInt32bâ was not declared in this scope
/root/openh323/include/rtp.h:330: error: expected primary-expression before â)â token
/root/openh323/include/rtp.h:330: error: âtheArrayâ was not declared in this scope
/root/openh323/include/rtp.h: At global scope:
/root/openh323/include/rtp.h:356: error: expected constructor, destructor, or type conversion before â(â token
/root/openh323/include/rtp.h:362: error: expected class-name before â{â token
/root/openh323/include/rtp.h:363: error: âPBYTEArrayâ has not been declared
/root/openh323/include/rtp.h:363: error: ISO C++ forbids declaration of âPCLASSINFOâ with no type
/root/openh323/include/rtp.h:366: error: expected `)' before âcompoundSizeâ
/root/openh323/include/rtp.h:384: error: âPINDEXâ does not name a type
/root/openh323/include/rtp.h:385: error: âPINDEXâ has not been declared
/root/openh323/include/rtp.h:387: error: ISO C++ forbids declaration of âBYTEâ with no type
/root/openh323/include/rtp.h:387: error: expected â;â before â*â token
/root/openh323/include/rtp.h:389: error: expected `;' before âBOOLâ
/root/openh323/include/rtp.h:389: error: âBOOLâ does not name a type
/root/openh323/include/rtp.h:390: error: âBOOLâ does not name a type
/root/openh323/include/rtp.h:392: error: âPINDEXâ does not name a type
/root/openh323/include/rtp.h:396: error: âPUInt32bâ does not name a type
/root/openh323/include/rtp.h:397: error: âBYTEâ does not name a type
/root/openh323/include/rtp.h:398: error: âBYTEâ does not name a type
/root/openh323/include/rtp.h:399: error: âPUInt32bâ does not name a type
/root/openh323/include/rtp.h:400: error: âPUInt32bâ does not name a type
/root/openh323/include/rtp.h:401: error: âPUInt32bâ does not name a type
/root/openh323/include/rtp.h:402: error: âPUInt32bâ does not name a type
/root/openh323/include/rtp.h:409: error: âPUInt32bâ does not name a type
/root/openh323/include/rtp.h:410: error: âPUInt32bâ does not name a type
/root/openh323/include/rtp.h:411: error: âPUInt32bâ does not name a type
/root/openh323/include/rtp.h:412: error: âPUInt32bâ does not name a type
/root/openh323/include/rtp.h:413: error: âPUInt32bâ does not name a type
/root/openh323/include/rtp.h:414: error: âPUInt32bâ does not name a type
/root/openh323/include/rtp.h:431: error: âPUInt32bâ does not name a type
/root/openh323/include/rtp.h:433: error: âBYTEâ does not name a type
/root/openh323/include/rtp.h:434: error: âBYTEâ does not name a type
/root/openh323/include/rtp.h:442: error: expected â;â before â(â token
/root/openh323/include/rtp.h:449: error: expected â,â or â...â before â&â token
/root/openh323/include/rtp.h:450: error: ISO C++ forbids declaration of âPStringâ with no type
/root/openh323/include/rtp.h:454: error: âPINDEXâ does not name a type
/root/openh323/include/rtp.h:455: error: âPINDEXâ does not name a type
/root/openh323/include/rtp.h: In member function âunsigned int RTP_ControlFrame::GetVersion() constâ:
/root/openh323/include/rtp.h:368: error: âBYTEâ was not declared in this scope
/root/openh323/include/rtp.h:368: error: expected â;â before âtheArrayâ
/root/openh323/include/rtp.h:368: error: âtheArrayâ was not declared in this scope
/root/openh323/include/rtp.h:368: error: âcompoundOffsetâ was not declared in this scope
/root/openh323/include/rtp.h: In member function âunsigned int RTP_ControlFrame::GetCount() constâ:
/root/openh323/include/rtp.h:370: error: âBYTEâ was not declared in this scope
/root/openh323/include/rtp.h:370: error: expected â;â before âtheArrayâ
/root/openh323/include/rtp.h:370: error: âtheArrayâ was not declared in this scope
/root/openh323/include/rtp.h:370: error: âcompoundOffsetâ was not declared in this scope
/root/openh323/include/rtp.h: In member function âunsigned int RTP_ControlFrame::GetPayloadType() constâ:
/root/openh323/include/rtp.h:381: error: âBYTEâ was not declared in this scope
/root/openh323/include/rtp.h:381: error: expected â;â before âtheArrayâ
/root/openh323/include/rtp.h:381: error: âtheArrayâ was not declared in this scope
/root/openh323/include/rtp.h:381: error: âcompoundOffsetâ was not declared in this scope
/root/openh323/include/rtp.h: In member function âunsigned int RTP_ControlFrame::ReceiverReport::GetLostPackets() constâ:
/root/openh323/include/rtp.h:404: error: âlostâ was not declared in this scope
/root/openh323/include/rtp.h: In member function âconst RTP_ControlFrame::SourceDescription::Item* RTP_ControlFrame::SourceDescription::Item::GetNextItem() constâ:
/root/openh323/include/rtp.h:437: error: âlengthâ was not declared in this scope
/root/openh323/include/rtp.h: In member function âRTP_ControlFrame::SourceDescription::Item* RTP_ControlFrame::SourceDescription::Item::GetNextItem()â:
/root/openh323/include/rtp.h:438: error: âlengthâ was not declared in this scope
/root/openh323/include/rtp.h: At global scope:
/root/openh323/include/rtp.h:466: error: expected class-name before â{â token
/root/openh323/include/rtp.h:467: error: âPObjectâ has not been declared
/root/openh323/include/rtp.h:467: error: ISO C++ forbids declaration of âPCLASSINFOâ with no type
/root/openh323/include/rtp.h:466: warning: âclass RTP_UserDataâ has virtual functions but non-virtual destructor
/root/openh323/include/rtp.h:495: error: expected class-name before â{â token
/root/openh323/include/rtp.h:496: error: âPObjectâ has not been declared
/root/openh323/include/rtp.h:496: error: ISO C++ forbids declaration of âPCLASSINFOâ with no type
/root/openh323/include/rtp.h:534: error: âPINDEXâ has not been declared
/root/openh323/include/rtp.h:545: error: âBOOLâ does not name a type
/root/openh323/include/rtp.h:553: error: âBOOLâ does not name a type
/root/openh323/include/rtp.h:563: error: âBOOLâ does not name a type
/root/openh323/include/rtp.h:569: error: âBOOLâ does not name a type
/root/openh323/include/rtp.h:575: error: âBOOLâ does not name a type
/root/openh323/include/rtp.h:581: error: âBOOLâ does not name a type
/root/openh323/include/rtp.h:586: error: âBOOLâ has not been declared
/root/openh323/include/rtp.h:591: error: âPStringâ does not name a type
/root/openh323/include/rtp.h:605: error: expected class-name before â{â token
/root/openh323/include/rtp.h:606: error: âPObjectâ has not been declared
/root/openh323/include/rtp.h:606: error: ISO C++ forbids declaration of âPCLASSINFOâ with no type
/root/openh323/include/rtp.h:608: error: âostreamâ has not been declared
/root/openh323/include/rtp.h:610: error: âDWORDâ does not name a type
/root/openh323/include/rtp.h:611: error: âDWORDâ does not name a type
/root/openh323/include/rtp.h:612: error: âDWORDâ does not name a type
/root/openh323/include/rtp.h:613: error: âDWORDâ does not name a type
/root/openh323/include/rtp.h:614: error: âDWORDâ does not name a type
/root/openh323/include/rtp.h:615: error: âPTimeIntervalâ does not name a type
/root/openh323/include/rtp.h:616: error: âPTimeIntervalâ does not name a type
/root/openh323/include/rtp.h:618: error: âReceiverReportArrayâ has not been declared
/root/openh323/include/rtp.h:618: error: ISO C++ forbids declaration of âPARRAYâ with no type
/root/openh323/include/rtp.h:620: error: expected class-name before â{â token
/root/openh323/include/rtp.h:621: error: âPObjectâ has not been declared
/root/openh323/include/rtp.h:621: error: ISO C++ forbids declaration of âPCLASSINFOâ with no type
/root/openh323/include/rtp.h:623: error: âostreamâ has not been declared
/root/openh323/include/rtp.h:625: error: âDWORDâ does not name a type
/root/openh323/include/rtp.h:626: error: âPTimeâ does not name a type
/root/openh323/include/rtp.h:627: error: âDWORDâ does not name a type
/root/openh323/include/rtp.h:628: error: âDWORDâ does not name a type
/root/openh323/include/rtp.h:629: error: âDWORDâ does not name a type
/root/openh323/include/rtp.h:632: error: expected â,â or â...â before â&â token
/root/openh323/include/rtp.h:632: error: ISO C++ forbids declaration of âReceiverReportArrayâ with no type
/root/openh323/include/rtp.h:633: error: âDWORDâ has not been declared
/root/openh323/include/rtp.h:634: error: expected â,â or â...â before â&â token
/root/openh323/include/rtp.h:634: error: ISO C++ forbids declaration of âReceiverReportArrayâ with no type
/root/openh323/include/rtp.h:636: error: expected class-name before â{â token
/root/openh323/include/rtp.h:637: error: âPObjectâ has not been declared
/root/openh323/include/rtp.h:637: error: ISO C++ forbids declaration of âPCLASSINFOâ with no type
/root/openh323/include/rtp.h:639: error: expected `)' before âsrcâ
/root/openh323/include/rtp.h:640: error: âostreamâ has not been declared
/root/openh323/include/rtp.h:642: error: âDWORDâ does not name a type
/root/openh323/include/rtp.h:643: error: âPOrdinalToStringâ does not name a type
/root/openh323/include/rtp.h:645: error: âSourceDescriptionArrayâ has not been declared
/root/openh323/include/rtp.h:645: error: ISO C++ forbids declaration of âPARRAYâ with no type
/root/openh323/include/rtp.h:646: error: expected â,â or â...â before â&â token
/root/openh323/include/rtp.h:646: error: ISO C++ forbids declaration of âSourceDescriptionArrayâ with no type
/root/openh323/include/rtp.h:648: error: expected â,â or â...â before â&â token
/root/openh323/include/rtp.h:649: error: ISO C++ forbids declaration of âPDWORDArrayâ with no type
/root/openh323/include/rtp.h:651: error: expected â,â or â...â before â&â token
/root/openh323/include/rtp.h:652: error: ISO C++ forbids declaration of âPStringâ with no type
/root/openh323/include/rtp.h:663: error: âPStringâ does not name a type
/root/openh323/include/rtp.h:667: error: expected â,â or â...â before â&â token
/root/openh323/include/rtp.h:667: error: ISO C++ forbids declaration of âPStringâ with no type
/root/openh323/include/rtp.h:671: error: âPStringâ does not name a type
/root/openh323/include/rtp.h:675: error: expected â,â or â...â before â&â token
/root/openh323/include/rtp.h:675: error: ISO C++ forbids declaration of âPStringâ with no type
/root/openh323/include/rtp.h:689: error: âDWORDâ does not name a type
/root/openh323/include/rtp.h:697: error: âBOOLâ does not name a type
/root/openh323/include/rtp.h:701: error: âBOOLâ does not name a type
/root/openh323/include/rtp.h:706: error: âBOOLâ has not been declared
/root/openh323/include/rtp.h:711: error: âBOOLâ does not name a type
/root/openh323/include/rtp.h:716: error: âBOOLâ has not been declared
/root/openh323/include/rtp.h:721: error: ISO C++ forbids declaration of âPTimeIntervalâ with no type
/root/openh323/include/rtp.h:721: error: expected â;â before â&â token
/root/openh323/include/rtp.h:725: error: expected `;' before âvoidâ
/root/openh323/include/rtp.h:726: error: expected â,â or â...â before â&â token
/root/openh323/include/rtp.h:727: error: ISO C++ forbids declaration of âPTimeIntervalâ with no type
/root/openh323/include/rtp.h:751: error: âDWORDâ does not name a type
/root/openh323/include/rtp.h:755: error: âDWORDâ does not name a type
/root/openh323/include/rtp.h:759: error: âDWORDâ does not name a type
/root/openh323/include/rtp.h:763: error: âDWORDâ does not name a type
/root/openh323/include/rtp.h:767: error: âDWORDâ does not name a type
/root/openh323/include/rtp.h:771: error: âDWORDâ does not name a type
/root/openh323/include/rtp.h:775: error: âDWORDâ does not name a type
/root/openh323/include/rtp.h:781: error: âDWORDâ does not name a type
/root/openh323/include/rtp.h:787: error: âDWORDâ does not name a type
/root/openh323/include/rtp.h:793: error: âDWORDâ does not name a type
/root/openh323/include/rtp.h:799: error: âDWORDâ does not name a type
/root/openh323/include/rtp.h:805: error: âDWORDâ does not name a type
/root/openh323/include/rtp.h:811: error: âDWORDâ does not name a type
/root/openh323/include/rtp.h:817: error: âDWORDâ does not name a type
/root/openh323/include/rtp.h:822: error: âDWORDâ does not name a type
/root/openh323/include/rtp.h:827: error: âPTimeâ does not name a type
/root/openh323/include/rtp.h:834: error: âPStringâ does not name a type
/root/openh323/include/rtp.h:835: error: âPStringâ does not name a type
/root/openh323/include/rtp.h:843: error: âBOOLâ does not name a type
/root/openh323/include/rtp.h:844: error: âBOOLâ does not name a type
/root/openh323/include/rtp.h:845: error: âDWORDâ does not name a type
/root/openh323/include/rtp.h:846: error: âDWORDâ does not name a type
/root/openh323/include/rtp.h:847: error: âPTimeIntervalâ does not name a type
/root/openh323/include/rtp.h:850: error: âWORDâ does not name a type
/root/openh323/include/rtp.h:851: error: âWORDâ does not name a type
/root/openh323/include/rtp.h:852: error: âDWORDâ does not name a type
/root/openh323/include/rtp.h:853: error: âPTimeIntervalâ does not name a type
/root/openh323/include/rtp.h:854: error: âPTimeIntervalâ does not name a type
/root/openh323/include/rtp.h:855: error: âWORDâ does not name a type
/root/openh323/include/rtp.h:856: error: âPINDEXâ does not name a type
/root/openh323/include/rtp.h:859: error: âDWORDâ does not name a type
/root/openh323/include/rtp.h:860: error: âDWORDâ does not name a type
/root/openh323/include/rtp.h:861: error: âDWORDâ does not name a type
/root/openh323/include/rtp.h:862: error: âDWORDâ does not name a type
/root/openh323/include/rtp.h:863: error: âDWORDâ does not name a type
/root/openh323/include/rtp.h:864: error: âDWORDâ does not name a type
/root/openh323/include/rtp.h:865: error: âDWORDâ does not name a type
/root/openh323/include/rtp.h:866: error: âDWORDâ does not name a type
/root/openh323/include/rtp.h:867: error: âDWORDâ does not name a type
/root/openh323/include/rtp.h:868: error: âDWORDâ does not name a type
/root/openh323/include/rtp.h:869: error: âDWORDâ does not name a type
/root/openh323/include/rtp.h:870: error: âDWORDâ does not name a type
/root/openh323/include/rtp.h:871: error: âDWORDâ does not name a type
/root/openh323/include/rtp.h:872: error: âDWORDâ does not name a type
/root/openh323/include/rtp.h:877: error: âDWORDâ does not name a type
/root/openh323/include/rtp.h:878: error: âDWORDâ does not name a type
/root/openh323/include/rtp.h:879: error: âDWORDâ does not name a type
/root/openh323/include/rtp.h:880: error: âDWORDâ does not name a type
/root/openh323/include/rtp.h:881: error: âDWORDâ does not name a type
/root/openh323/include/rtp.h:882: error: âDWORDâ does not name a type
/root/openh323/include/rtp.h:883: error: âDWORDâ does not name a type
/root/openh323/include/rtp.h:884: error: âDWORDâ does not name a type
/root/openh323/include/rtp.h:885: error: âPTimeâ does not name a type
/root/openh323/include/rtp.h:887: error: âPMutexâ does not name a type
/root/openh323/include/rtp.h:888: error: âPTimerâ does not name a type
/root/openh323/include/rtp.h:495: warning: âclass RTP_Sessionâ has virtual functions but non-virtual destructor
/root/openh323/include/rtp.h:496: error: cannot declare parameter â<anonymous>â to be of abstract type âRTP_Sessionâ
/root/openh323/include/rtp.h:495: note: because the following virtual functions are pure within âRTP_Sessionâ:
/root/openh323/include/rtp.h:587: note: virtual void RTP_Session::Close(int)
/root/openh323/include/rtp.h:511: error: âNULLâ was not declared in this scope
/root/openh323/include/rtp.h: In member function âvoid RTP_Session::SetIgnoreOtherSources(int)â:
/root/openh323/include/rtp.h:707: error: âignoreOtherSourcesâ was not declared in this scope
/root/openh323/include/rtp.h: In member function âvoid RTP_Session::SetIgnoreOutOfOrderPackets(int)â:
/root/openh323/include/rtp.h:717: error: âignoreOutOfOrderPacketsâ was not declared in this scope
/root/openh323/include/rtp.h: In member function âvoid RTP_Session::SetReportTimeInterval(int)â:
/root/openh323/include/rtp.h:727: error: âreportTimeIntervalâ was not declared in this scope
/root/openh323/include/rtp.h:727: error: âintervalâ was not declared in this scope
/root/openh323/include/rtp.h: At global scope:
/root/openh323/include/rtp.h:895: error: expected class-name before â{â token
/root/openh323/include/rtp.h:896: error: âPObjectâ has not been declared
/root/openh323/include/rtp.h:896: error: ISO C++ forbids declaration of âPCLASSINFOâ with no type
/root/openh323/include/rtp.h:989: error: âSessionDictâ has not been declared
/root/openh323/include/rtp.h:989: error: âPOrdinalKeyâ has not been declared
/root/openh323/include/rtp.h:989: error: ISO C++ forbids declaration of âPDICTIONARYâ with no type
/root/openh323/include/rtp.h:989: error: cannot declare parameter â<anonymous>â to be of abstract type âRTP_Sessionâ
/root/openh323/include/rtp.h:495: note: since type âRTP_Sessionâ has pure virtual functions
/root/openh323/include/rtp.h:990: error: âSessionDictâ does not name a type
/root/openh323/include/rtp.h:991: error: âPMutexâ does not name a type
/root/openh323/include/rtp.h:992: error: âPINDEXâ does not name a type
/root/openh323/include/rtp.h:1001: error: ISO C++ forbids declaration of âPCLASSINFOâ with no type
/root/openh323/include/rtp.h:1001: error: cannot declare parameter â<anonymous>â to be of abstract type âRTP_Sessionâ
/root/openh323/include/rtp.h:495: note: since type âRTP_Sessionâ has pure virtual functions
/root/openh323/include/rtp.h:1010: error: âBOOLâ has not been declared
/root/openh323/include/rtp.h:1024: error: âBOOLâ does not name a type
/root/openh323/include/rtp.h:1028: error: âBOOLâ does not name a type
/root/openh323/include/rtp.h:1032: error: âBOOLâ does not name a type
/root/openh323/include/rtp.h:1037: error: âBOOLâ has not been declared
/root/openh323/include/rtp.h:1042: error: âPStringâ does not name a type
/root/openh323/include/rtp.h:1049: error: âBOOLâ does not name a type
/root/openh323/include/rtp.h:1066: error: âBOOLâ does not name a type
/root/openh323/include/rtp.h:1082: error: âBOOLâ has not been declared
/root/openh323/include/rtp.h:1089: error: âPIPSocketâ has not been declared
/root/openh323/include/rtp.h:1089: error: âAddressâ does not name a type
/root/openh323/include/rtp.h:1094: error: âPIPSocketâ has not been declared
/root/openh323/include/rtp.h:1094: error: expected â,â or â...â before â&â token
/root/openh323/include/rtp.h:1095: error: ISO C++ forbids declaration of âAddressâ with no type
/root/openh323/include/rtp.h:1099: error: âPIPSocketâ has not been declared
/root/openh323/include/rtp.h:1099: error: âAddressâ does not name a type
/root/openh323/include/rtp.h:1103: error: âWORDâ does not name a type
/root/openh323/include/rtp.h:1107: error: âWORDâ does not name a type
/root/openh323/include/rtp.h:1111: error: âWORDâ does not name a type
/root/openh323/include/rtp.h:1115: error: âWORDâ does not name a type
/root/openh323/include/rtp.h:1119: error: ISO C++ forbids declaration of âPUDPSocketâ with no type
/root/openh323/include/rtp.h:1119: error: expected â;â before â&â token
/root/openh323/include/rtp.h:1123: error: expected `;' before âPUDPSocketâ
/root/openh323/include/rtp.h:1123: error: ISO C++ forbids declaration of âPUDPSocketâ with no type
/root/openh323/include/rtp.h:1123: error: expected â;â before â&â token
/root/openh323/include/rtp.h:1127: error: expected `;' before âBOOLâ
/root/openh323/include/rtp.h:1127: error: âBOOLâ does not name a type
/root/openh323/include/rtp.h:1136: error: âPIPSocketâ has not been declared
/root/openh323/include/rtp.h:1136: error: expected â,â or â...â before â&â token
/root/openh323/include/rtp.h:1137: error: ISO C++ forbids declaration of âAddressâ with no type
/root/openh323/include/rtp.h:1144: error: âPUDPSocketâ has not been declared
/root/openh323/include/rtp.h:1145: error: âPBYTEArrayâ has not been declared
/root/openh323/include/rtp.h:1146: error: âBOOLâ has not been declared
/root/openh323/include/rtp.h:1149: error: âPIPSocketâ has not been declared
/root/openh323/include/rtp.h:1149: error: âAddressâ does not name a type
/root/openh323/include/rtp.h:1150: error: âWORDâ does not name a type
/root/openh323/include/rtp.h:1151: error: âWORDâ does not name a type
/root/openh323/include/rtp.h:1153: error: âPIPSocketâ has not been declared
/root/openh323/include/rtp.h:1153: error: âAddressâ does not name a type
/root/openh323/include/rtp.h:1154: error: âWORDâ does not name a type
/root/openh323/include/rtp.h:1155: error: âWORDâ does not name a type
/root/openh323/include/rtp.h:1157: error: âPIPSocketâ has not been declared
/root/openh323/include/rtp.h:1157: error: âAddressâ does not name a type
/root/openh323/include/rtp.h:1159: error: âBOOLâ does not name a type
/root/openh323/include/rtp.h:1160: error: âBOOLâ does not name a type
/root/openh323/include/rtp.h:1162: error: ISO C++ forbids declaration of âPUDPSocketâ with no type
/root/openh323/include/rtp.h:1162: error: expected â;â before â*â token
/root/openh323/include/rtp.h:1163: error: ISO C++ forbids declaration of âPUDPSocketâ with no type
/root/openh323/include/rtp.h:1163: error: expected â;â before â*â token
/root/openh323/include/rtp.h:1165: error: âBOOLâ does not name a type
/root/openh323/include/rtp.h:1166: error: âBOOLâ does not name a type
/root/openh323/include/rtp.h:1168: error: âBOOLâ does not name a type
/root/openh323/include/rtp.h:1000: warning: âclass RTP_UDPâ has virtual functions but non-virtual destructor
/root/openh323/include/rtp.h:1010: error: âFALSEâ was not declared in this scope
/root/openh323/include/rtp.h: In member function âvoid RTP_UDP::SetLocalAddress(int)â:
/root/openh323/include/rtp.h:1095: error: âlocalAddressâ was not declared in this scope
/root/openh323/include/rtp.h:1095: error: âaddrâ was not declared in this scope
/root/openh323/include/mediafmt.h: At global scope:
/root/openh323/include/mediafmt.h:133: error: expected class-name before â{â token
/root/openh323/include/mediafmt.h:134: error: âPCaselessStringâ has not been declared
/root/openh323/include/mediafmt.h:134: error: ISO C++ forbids declaration of âPCLASSINFOâ with no type
/root/openh323/include/mediafmt.h:137: error: âListâ has not been declared
/root/openh323/include/mediafmt.h:137: error: ISO C++ forbids declaration of âPLISTâ with no type
/root/openh323/include/mediafmt.h:149: error: âBOOLâ has not been declared
/root/openh323/include/mediafmt.h:156: error: âBOOLâ does not name a type
/root/openh323/include/mediafmt.h:178: error: âBOOLâ does not name a type
/root/openh323/include/mediafmt.h:188: error: âPINDEXâ does not name a type
/root/openh323/include/mediafmt.h:206: error: âListâ does not name a type
/root/openh323/include/mediafmt.h:207: error: âListâ has not been declared
/root/openh323/include/mediafmt.h:228: error: âBOOLâ has not been declared
/root/openh323/include/mediafmt.h:230: error: âPINDEXâ has not been declared
/root/openh323/include/mediafmt.h:233: error: âtime_tâ has not been declared
/root/openh323/include/mediafmt.h:238: error: âBOOLâ does not name a type
/root/openh323/include/mediafmt.h:240: error: âPINDEXâ does not name a type
/root/openh323/include/mediafmt.h:243: error: âtime_tâ does not name a type
/root/openh323/include/mediafmt.h:149: error: âTRUEâ was not declared in this scope
/root/openh323/include/mediafmt.h:327: error: expected initializer before â<â token
/root/openh323/include/transports.h:227: error: expected class-name before â{â token
/root/openh323/include/transports.h:228: error: âPStringâ has not been declared
/root/openh323/include/transports.h:228: error: ISO C++ forbids declaration of âPCLASSINFOâ with no type
/root/openh323/include/transports.h:232: error: expected â,â or â...â before â&â token
/root/openh323/include/transports.h:232: error: ISO C++ forbids declaration of âPStringâ with no type
/root/openh323/include/transports.h:235: error: âPIPSocketâ has not been declared
/root/openh323/include/transports.h:235: error: expected â,â or â...â before â&â token
/root/openh323/include/transports.h:235: error: ISO C++ forbids declaration of âAddressâ with no type
/root/openh323/include/transports.h:235: error: âH323TransportAddress::H323TransportAddress(int)â cannot be overloaded
/root/openh323/include/transports.h:232: error: with âH323TransportAddress::H323TransportAddress(int)â
/root/openh323/include/transports.h:237: error: âBOOLâ does not name a type
/root/openh323/include/transports.h:238: error: âBOOLâ does not name a type
/root/openh323/include/transports.h:242: error: âBOOLâ does not name a type
/root/openh323/include/transports.h:249: error: âBOOLâ does not name a type
/root/openh323/include/transports.h:256: error: âBOOLâ does not name a type
/root/openh323/include/transports.h:265: error: âPStringâ does not name a type
/root/openh323/include/transports.h:302: error: expected constructor, destructor, or type conversion before â(â token
/root/openh323/include/transports.h:312: error: expected constructor, destructor, or type conversion before â;â token
/root/openh323/include/transports.h:314: error: expected â,â or â...â before â&â token
/root/openh323/include/transports.h:315: error: ISO C++ forbids declaration of âH323TransportAddressArrayâ with no type
/root/openh323/include/transports.h:315: error: ISO C++ forbids declaration of âPStringArrayâ with no type
/root/openh323/include/transports.h: In function âint H323TransportAddressArray(int)â:
/root/openh323/include/transports.h:315: error: âarrayâ was not declared in this scope
/root/openh323/include/transports.h:315: error: âAppendStringCollectionâ was not declared in this scope
/root/openh323/include/transports.h: At global scope:
/root/openh323/include/transports.h:317: error: expected â,â or â...â before â&â token
/root/openh323/include/transports.h:318: error: ISO C++ forbids declaration of âH323TransportAddressArrayâ with no type
/root/openh323/include/transports.h:318: error: ISO C++ forbids declaration of âPStringListâ with no type
/root/openh323/include/transports.h: In function âint H323TransportAddressArray(int)â:
/root/openh323/include/transports.h:318: error: redefinition of âint H323TransportAddressArray(int)â
/root/openh323/include/transports.h:315: error: âint H323TransportAddressArray(int)â previously defined here
/root/openh323/include/transports.h:318: error: âlistâ was not declared in this scope
/root/openh323/include/transports.h:318: error: âAppendStringCollectionâ was not declared in this scope
/root/openh323/include/transports.h: At global scope:
/root/openh323/include/transports.h:320: error: expected â,â or â...â before â&â token
/root/openh323/include/transports.h:321: error: ISO C++ forbids declaration of âH323TransportAddressArrayâ with no type
/root/openh323/include/transports.h:321: error: ISO C++ forbids declaration of âPSortedStringListâ with no type
/root/openh323/include/transports.h: In function âint H323TransportAddressArray(int)â:
/root/openh323/include/transports.h:321: error: redefinition of âint H323TransportAddressArray(int)â
/root/openh323/include/transports.h:315: error: âint H323TransportAddressArray(int)â previously defined here
/root/openh323/include/transports.h:321: error: âlistâ was not declared in this scope
/root/openh323/include/transports.h:321: error: âAppendStringCollectionâ was not declared in this scope
/root/openh323/include/transports.h: At global scope:
/root/openh323/include/transports.h:327: error: expected â,â or â...â before â&â token
/root/openh323/include/transports.h:328: error: ISO C++ forbids declaration of âPStringâ with no type
/root/openh323/include/transports.h:333: error: expected unqualified-id before âprotectedâ
/root/openh323/include/transports.h:337: error: expected declaration before â}â token
/root/openh323/include/transports.h: In function âint H323TransportAddressArray(int)â:
/root/openh323/include/transports.h:315: warning: control reaches end of non-void function
/root/openh323/include/transports.h: In function âint H323TransportAddressArray(int)â:
/root/openh323/include/transports.h:318: warning: control reaches end of non-void function
/root/openh323/include/transports.h: In function âint H323TransportAddressArray(int)â:
/root/openh323/include/transports.h:321: warning: control reaches end of non-void function
make[1]: *** [h323chan.yate] Error 1
make[1]: Leaving directory `/root/yate/modules'
make: *** [modules] Error 2