All pastes #404192 Raw Edit

Stuff

public text v1 · immutable
·published 2007-03-20 21:27 UTC
rendered paste body
lontra@debian:~/Download/amarokFS-0.5$ make
g++ -c -pipe -Wall -W -O2 -D_REENTRANT  -DQT_NO_DEBUG -DQT_THREAD_SUPPORT -DQT_SHARED -DQT_TABLET_SUPPORT -I/usr/share/qt3/mkspecs/default -I. -I/usr/include/kde -I/usr/local/include/kde -I/usr/include -I/opt/kde3/include -I/opt/kde/include -I/usr/kde/3.5/include -I/usr/include/qt3 -o main.o main.cpp
main.cpp:22:26: error: kapplication.h: No such file or directory
main.cpp:23:24: error: kaboutdata.h: No such file or directory
main.cpp:24:26: error: kcmdlineargs.h: No such file or directory
main.cpp:25:31: error: kaboutapplication.h: No such file or directory
In file included from amfs-xml.h:7,
                 from main.cpp:28:
amarokfs_config.h:15:27: error: kurlrequester.h: No such file or directory
In file included from main.cpp:28:
amfs-xml.h:29:26: error: dcopclient.h: No such file or directory
amfs-xml.h:84: error: ISO C++ forbids declaration of ‘DCOPClient’ with no type
amfs-xml.h:84: error: expected ‘;’ before ‘*’ token
amfs-xml.h:111: error: ISO C++ forbids declaration of ‘KAboutApplication’ with no type
amfs-xml.h:111: error: expected ‘;’ before ‘*’ token
main.cpp: In function ‘int main(int, char**)’:
main.cpp:35: error: ‘KAboutData’ was not declared in this scope
main.cpp:35: error: ‘about’ was not declared in this scope
main.cpp:35: error: expected type-specifier before ‘KAboutData’
main.cpp:35: error: expected `;' before ‘KAboutData’
main.cpp:41: error: ‘KCmdLineArgs’ has not been declared
main.cpp:42: error: ‘KCmdLineOptions’ was not declared in this scope
main.cpp:42: error: expected `;' before ‘options’
main.cpp:48: error: ‘KCmdLineArgs’ has not been declared
main.cpp:48: error: ‘options’ was not declared in this scope
main.cpp:49: error: ‘KCmdLineArgs’ was not declared in this scope
main.cpp:49: error: ‘args’ was not declared in this scope
main.cpp:49: error: ‘KCmdLineArgs’ is not a class or namespace
main.cpp:51: error: ‘KApplication’ was not declared in this scope
main.cpp:51: error: expected `;' before ‘a’
main.cpp:61: error: ‘class AmfsXML’ has no member named ‘aboutWindow’
main.cpp:61: error: expected type-specifier before ‘KAboutApplication’
main.cpp:61: error: expected `;' before ‘KAboutApplication’
main.cpp:66: error: ‘a’ was not declared in this scope
make: *** [main.o] Error 1