All pastes #40393 Raw Edit

Something

public text v1 · immutable
#40393 ·published 2006-02-06 21:25 UTC
rendered paste body
Making all in common
make[1]: Entering directory `/home/pippijn/Programs/src/compile/crossfire/common'
make[1]: Nothing to be done for `all'.
make[1]: Leaving directory `/home/pippijn/Programs/src/compile/crossfire/common'
Making all in random_maps
make[1]: Entering directory `/home/pippijn/Programs/src/compile/crossfire/random_maps'
make[1]: Nothing to be done for `all'.
make[1]: Leaving directory `/home/pippijn/Programs/src/compile/crossfire/random_maps'
Making all in socket
make[1]: Entering directory `/home/pippijn/Programs/src/compile/crossfire/socket'
make[1]: Nothing to be done for `all'.
make[1]: Leaving directory `/home/pippijn/Programs/src/compile/crossfire/socket'
Making all in server
make[1]: Entering directory `/home/pippijn/Programs/src/compile/crossfire/server'
make[1]: Nothing to be done for `all'.
make[1]: Leaving directory `/home/pippijn/Programs/src/compile/crossfire/server'
Making all in include
make[1]: Entering directory `/home/pippijn/Programs/src/compile/crossfire/include'
make  all-am
make[2]: Entering directory `/home/pippijn/Programs/src/compile/crossfire/include'
make[2]: Leaving directory `/home/pippijn/Programs/src/compile/crossfire/include'
make[1]: Leaving directory `/home/pippijn/Programs/src/compile/crossfire/include'
Making all in lib
make[1]: Entering directory `/home/pippijn/Programs/src/compile/crossfire/lib'
make[1]: Nothing to be done for `all'.
make[1]: Leaving directory `/home/pippijn/Programs/src/compile/crossfire/lib'
Making all in utils
make[1]: Entering directory `/home/pippijn/Programs/src/compile/crossfire/utils'
make[1]: Nothing to be done for `all'.
make[1]: Leaving directory `/home/pippijn/Programs/src/compile/crossfire/utils'
Making all in doc
make[1]: Entering directory `/home/pippijn/Programs/src/compile/crossfire/doc'
Making all in scripts
make[2]: Entering directory `/home/pippijn/Programs/src/compile/crossfire/doc/scripts'
make[2]: Nothing to be done for `all'.
make[2]: Leaving directory `/home/pippijn/Programs/src/compile/crossfire/doc/scripts'
Making all in Developers
make[2]: Entering directory `/home/pippijn/Programs/src/compile/crossfire/doc/Developers'
make[2]: Nothing to be done for `all'.
make[2]: Leaving directory `/home/pippijn/Programs/src/compile/crossfire/doc/Developers'
Making all in playbook
make[2]: Entering directory `/home/pippijn/Programs/src/compile/crossfire/doc/playbook'
make[2]: Nothing to be done for `all'.
make[2]: Leaving directory `/home/pippijn/Programs/src/compile/crossfire/doc/playbook'
Making all in spoiler
make[2]: Entering directory `/home/pippijn/Programs/src/compile/crossfire/doc/spoiler'
make[2]: Nothing to be done for `all'.
make[2]: Leaving directory `/home/pippijn/Programs/src/compile/crossfire/doc/spoiler'
Making all in spell-docs
make[2]: Entering directory `/home/pippijn/Programs/src/compile/crossfire/doc/spell-docs'
make[2]: Nothing to be done for `all'.
make[2]: Leaving directory `/home/pippijn/Programs/src/compile/crossfire/doc/spell-docs'
Making all in spoiler-html
make[2]: Entering directory `/home/pippijn/Programs/src/compile/crossfire/doc/spoiler-html'
make[2]: Nothing to be done for `all'.
make[2]: Leaving directory `/home/pippijn/Programs/src/compile/crossfire/doc/spoiler-html'
Making all in playbook-html
make[2]: Entering directory `/home/pippijn/Programs/src/compile/crossfire/doc/playbook-html'
make[2]: Nothing to be done for `all'.
make[2]: Leaving directory `/home/pippijn/Programs/src/compile/crossfire/doc/playbook-html'
make[2]: Entering directory `/home/pippijn/Programs/src/compile/crossfire/doc'
make[2]: Nothing to be done for `all-am'.
make[2]: Leaving directory `/home/pippijn/Programs/src/compile/crossfire/doc'
make[1]: Leaving directory `/home/pippijn/Programs/src/compile/crossfire/doc'
Making all in plugins
make[1]: Entering directory `/home/pippijn/Programs/src/compile/crossfire/plugins'
Making all in cfpython
make[2]: Entering directory `/home/pippijn/Programs/src/compile/crossfire/plugins/cfpython'
make[2]: Nothing to be done for `all'.
make[2]: Leaving directory `/home/pippijn/Programs/src/compile/crossfire/plugins/cfpython'
Making all in cfanim
make[2]: Entering directory `/home/pippijn/Programs/src/compile/crossfire/plugins/cfanim'
make[2]: Nothing to be done for `all'.
make[2]: Leaving directory `/home/pippijn/Programs/src/compile/crossfire/plugins/cfanim'
Making all in cfperl
make[2]: Entering directory `/home/pippijn/Programs/src/compile/crossfire/plugins/cfperl'
make[2]: Nothing to be done for `all'.
make[2]: Leaving directory `/home/pippijn/Programs/src/compile/crossfire/plugins/cfperl'
make[2]: Entering directory `/home/pippijn/Programs/src/compile/crossfire/plugins'
make[2]: Nothing to be done for `all-am'.
make[2]: Leaving directory `/home/pippijn/Programs/src/compile/crossfire/plugins'
make[1]: Leaving directory `/home/pippijn/Programs/src/compile/crossfire/plugins'
Making all in devel
make[1]: Entering directory `/home/pippijn/Programs/src/compile/crossfire/devel'
make[1]: Nothing to be done for `all'.
make[1]: Leaving directory `/home/pippijn/Programs/src/compile/crossfire/devel'
Making all in crossedit
make[1]: Entering directory `/home/pippijn/Programs/src/compile/crossfire/crossedit'
Making all in include
make[2]: Entering directory `/home/pippijn/Programs/src/compile/crossfire/crossedit/include'
make[2]: Nothing to be done for `all'.
make[2]: Leaving directory `/home/pippijn/Programs/src/compile/crossfire/crossedit/include'
Making all in Cnv
make[2]: Entering directory `/home/pippijn/Programs/src/compile/crossfire/crossedit/Cnv'
if gcc -DHAVE_CONFIG_H -I. -I. -I../../include  -I./../include -I../../include   -g -O2  -D_REENTRANT -D_GNU_SOURCE -DTHREADS_HAVE_PIDS -DDEBIAN -fno-strict-aliasing -pipe -I/usr/local/include -D_LARGEFILE_SOURCE -D_FILE_OFFSET_BITS=64  -I/usr/lib/perl/5.8/CORE  -MT CnvUtil.o -MD -MP -MF ".deps/CnvUtil.Tpo" -c -o CnvUtil.o CnvUtil.c; \
	then mv -f ".deps/CnvUtil.Tpo" ".deps/CnvUtil.Po"; else rm -f ".deps/CnvUtil.Tpo"; exit 1; fi
In file included from ./Cnv.h:26,
                 from CnvUtil.c:22:
./../include/Xaw.h:30:27: error: X11/Intrinsic.h: No such file or directory
./../include/Xaw.h:31:23: error: X11/Shell.h: No such file or directory
./../include/Xaw.h:32:28: error: X11/StringDefs.h: No such file or directory
./../include/Xaw.h:33:31: error: X11/Xaw/Cardinals.h: No such file or directory
./../include/Xaw.h:36:29: error: X11/Xaw/Command.h: No such file or directory
./../include/Xaw.h:37:26: error: X11/Xaw/Grip.h: No such file or directory
./../include/Xaw.h:38:27: error: X11/Xaw/Label.h: No such file or directory
./../include/Xaw.h:39:26: error: X11/Xaw/List.h: No such file or directory
./../include/Xaw.h:40:28: error: X11/Xaw/Panner.h: No such file or directory
./../include/Xaw.h:41:30: error: X11/Xaw/Repeater.h: No such file or directory
./../include/Xaw.h:42:31: error: X11/Xaw/Scrollbar.h: No such file or directory
./../include/Xaw.h:43:32: error: X11/Xaw/StripChart.h: No such file or directory
./../include/Xaw.h:44:28: error: X11/Xaw/Toggle.h: No such file or directory
./../include/Xaw.h:47:32: error: X11/Xaw/MenuButton.h: No such file or directory
./../include/Xaw.h:48:32: error: X11/Xaw/SimpleMenu.h: No such file or directory
./../include/Xaw.h:49:25: error: X11/Xaw/Sme.h: No such file or directory
./../include/Xaw.h:50:28: error: X11/Xaw/SmeBSB.h: No such file or directory
./../include/Xaw.h:51:29: error: X11/Xaw/SmeLine.h: No such file or directory
./../include/Xaw.h:54:31: error: X11/Xaw/AsciiText.h: No such file or directory
./../include/Xaw.h:55:26: error: X11/Xaw/Text.h: No such file or directory
./../include/Xaw.h:58:25: error: X11/Xaw/Box.h: No such file or directory
./../include/Xaw.h:59:28: error: X11/Xaw/Dialog.h: No such file or directory
./../include/Xaw.h:60:26: error: X11/Xaw/Form.h: No such file or directory
./../include/Xaw.h:61:27: error: X11/Xaw/Paned.h: No such file or directory
./../include/Xaw.h:62:30: error: X11/Xaw/Porthole.h: No such file or directory
./../include/Xaw.h:63:26: error: X11/Xaw/Tree.h: No such file or directory
./../include/Xaw.h:64:30: error: X11/Xaw/Viewport.h: No such file or directory
In file included from CnvUtil.c:22:
./Cnv.h:42: warning: parameter names (without types) in function declaration
./Cnv.h:44: error: syntax error before 'CnvMenu'
./Cnv.h:44: error: syntax error before 'CnvMenuRec'
./Cnv.h:44: warning: data definition has no type or storage class
./Cnv.h:62: error: syntax error before 'Widget'
./Cnv.h:62: warning: no semicolon at end of struct or union
./Cnv.h:63: warning: data definition has no type or storage class
./Cnv.h:64: error: syntax error before 'fileList'
./Cnv.h:64: warning: data definition has no type or storage class
./Cnv.h:65: error: syntax error before 'cwd'
./Cnv.h:65: warning: data definition has no type or storage class
./Cnv.h:66: error: syntax error before 'text'
./Cnv.h:66: warning: data definition has no type or storage class
./Cnv.h:68: error: syntax error before 'dirTable'
./Cnv.h:68: warning: data definition has no type or storage class
./Cnv.h:69: error: syntax error before 'fileTable'
./Cnv.h:69: warning: data definition has no type or storage class
./Cnv.h:70: error: syntax error before 'fileNro'
./Cnv.h:70: warning: data definition has no type or storage class
./Cnv.h:71: error: syntax error before 'dirNro'
./Cnv.h:71: warning: data definition has no type or storage class
./Cnv.h:76: error: syntax error before '}' token
./Cnv.h:76: warning: data definition has no type or storage class
./Cnv.h:78: error: syntax error before 'CnvPathCreate'
./Cnv.h:78: error: syntax error before 'name'
./Cnv.h:78: warning: data definition has no type or storage class
./Cnv.h:79: error: syntax error before 'self'
./Cnv.h:80: error: syntax error before 'CnvPathNoAccess'
./Cnv.h:80: error: syntax error before 'w'
./Cnv.h:80: warning: data definition has no type or storage class
./Cnv.h:81: error: syntax error before 'CnvPathNoWrite'
./Cnv.h:81: error: syntax error before 'w'
./Cnv.h:81: warning: data definition has no type or storage class
./Cnv.h:82: error: syntax error before 'self'
./Cnv.h:89: error: syntax error before 'client'
./Cnv.h:93: error: syntax error before 'Widget'
./Cnv.h:93: warning: no semicolon at end of struct or union
./Cnv.h:94: warning: data definition has no type or storage class
./Cnv.h:97: error: syntax error before 'client'
./Cnv.h:97: warning: data definition has no type or storage class
./Cnv.h:99: warning: data definition has no type or storage class
./Cnv.h:101: error: syntax error before 'CnvFilesCreate'
./Cnv.h:101: error: syntax error before 'CnvFilesProc'
./Cnv.h:101: warning: data definition has no type or storage class
./Cnv.h:102: warning: parameter names (without types) in function declaration
./Cnv.h:103: error: syntax error before 'CnvFilesRescan'
./Cnv.h:103: error: syntax error before 'directory'
./Cnv.h:103: warning: data definition has no type or storage class
./Cnv.h:112: error: syntax error before 'XtPointer'
./Cnv.h:118: error: syntax error before 'Widget'
./Cnv.h:118: warning: no semicolon at end of struct or union
./Cnv.h:119: warning: data definition has no type or storage class
./Cnv.h:120: error: syntax error before 'file'
./Cnv.h:120: warning: data definition has no type or storage class
./Cnv.h:121: error: syntax error before 'ok'
./Cnv.h:121: warning: data definition has no type or storage class
./Cnv.h:122: error: syntax error before 'isup'
./Cnv.h:122: warning: data definition has no type or storage class
./Cnv.h:124: error: syntax error before '}' token
./Cnv.h:134: error: syntax error before 'name'
./Cnv.h:137: error: syntax error before 'String'
./Cnv.h:138: error: syntax error before 'String'
./Cnv.h:139: error: syntax error before 'String'
./Cnv.h:145: error: syntax error before 'Widget'
./Cnv.h:145: warning: no semicolon at end of struct or union
./Cnv.h:147: error: syntax error before 'Pixmap'
./Cnv.h:147: warning: no semicolon at end of struct or union
./Cnv.h:148: warning: data definition has no type or storage class
./Cnv.h:149: error: syntax error before 'flagoff'
./Cnv.h:149: warning: data definition has no type or storage class
./Cnv.h:150: error: syntax error before 'flagon'
./Cnv.h:150: warning: data definition has no type or storage class
./Cnv.h:151: error: syntax error before 'notify'
./Cnv.h:151: warning: data definition has no type or storage class
./Cnv.h:152: error: syntax error before 'prompt'
./Cnv.h:152: warning: data definition has no type or storage class
./Cnv.h:153: error: syntax error before 'submenu'
./Cnv.h:153: warning: data definition has no type or storage class
./Cnv.h:154: warning: data definition has no type or storage class
./Cnv.h:155: error: syntax error before '}' token
./Cnv.h:155: warning: data definition has no type or storage class
./Cnv.h:156: error: syntax error before 'cnv'
./Cnv.h:156: warning: data definition has no type or storage class
./Cnv.h:161: error: syntax error before 'w'
./Cnv.h:162: error: syntax error before 'self'
./Cnv.h:163: error: syntax error before 'CnvGetShell'
./Cnv.h:163: error: syntax error before 'child'
./Cnv.h:163: warning: data definition has no type or storage class
./Cnv.h:164: error: syntax error before 'msg'
./Cnv.h:165: error: syntax error before 'msg'
./Cnv.h:166: error: syntax error before 'self'
./Cnv.h:167: error: syntax error before 'shell'
./Cnv.h:168: error: syntax error before 'self'
CnvUtil.c:40: error: syntax error before 'w'
CnvUtil.c:45: error: syntax error before 'CnvActions'
CnvUtil.c:46: warning: braces around scalar initializer
CnvUtil.c:46: warning: (near initialization for 'CnvActions[0]')
CnvUtil.c:46: warning: initialization makes integer from pointer without a cast
CnvUtil.c:46: warning: excess elements in scalar initializer
CnvUtil.c:46: warning: (near initialization for 'CnvActions[0]')
CnvUtil.c:47: warning: data definition has no type or storage class
CnvUtil.c:53: error: syntax error before 'cnv'
CnvUtil.c:53: warning: data definition has no type or storage class
CnvUtil.c:59: error: syntax error before 'shell'
CnvUtil.c: In function 'CnvInitialize':
CnvUtil.c:62: warning: assignment makes integer from pointer without a cast
CnvUtil.c:62: error: syntax error before 'XtMalloc'
CnvUtil.c:63: error: invalid type argument of '->'
CnvUtil.c:63: error: 'shell' undeclared (first use in this function)
CnvUtil.c:63: error: (Each undeclared identifier is reported only once
CnvUtil.c:63: error: for each function it appears in.)
CnvUtil.c:67: error: invalid type argument of '->'
CnvUtil.c:72: error: invalid type argument of '->'
CnvUtil.c:77: error: invalid type argument of '->'
CnvUtil.c:82: error: invalid type argument of '->'
CnvUtil.c:87: error: invalid type argument of '->'
CnvUtil.c:92: error: invalid type argument of '->'
CnvUtil.c:97: error: invalid type argument of '->'
CnvUtil.c:105: error: invalid type argument of '->'
CnvUtil.c: At top level:
CnvUtil.c:117: error: syntax error before 'CnvGetShell'
CnvUtil.c:117: error: syntax error before 'child'
CnvUtil.c: In function 'CnvGetShell':
CnvUtil.c:119: error: 'Widget' undeclared (first use in this function)
CnvUtil.c:119: error: syntax error before 'use'
CnvUtil.c:121: error: 'use' undeclared (first use in this function)
CnvUtil.c:121: error: 'child' undeclared (first use in this function)
CnvUtil.c:122: error: 'False' undeclared (first use in this function)
CnvUtil.c: At top level:
CnvUtil.c:135: error: syntax error before 'w'
CnvUtil.c: In function 'CnvCenterWidget':
CnvUtil.c:137: error: 'Position' undeclared (first use in this function)
CnvUtil.c:137: error: syntax error before 'x'
CnvUtil.c:138: error: 'Dimension' undeclared (first use in this function)
CnvUtil.c:141: error: 'w' undeclared (first use in this function)
CnvUtil.c:142: error: 'XtNwidth' undeclared (first use in this function)
CnvUtil.c:142: error: 'width' undeclared (first use in this function)
CnvUtil.c:142: error: 'XtNheight' undeclared (first use in this function)
CnvUtil.c:142: error: 'height' undeclared (first use in this function)
CnvUtil.c:143: error: 'XtNborderWidth' undeclared (first use in this function)
CnvUtil.c:143: error: 'border' undeclared (first use in this function)
CnvUtil.c:144: error: 'x' undeclared (first use in this function)
CnvUtil.c:145: error: 'y' undeclared (first use in this function)
CnvUtil.c:146: error: 'XtNx' undeclared (first use in this function)
CnvUtil.c:146: error: 'XtNy' undeclared (first use in this function)
CnvUtil.c: At top level:
CnvUtil.c:184: error: syntax error before 'self'
CnvUtil.c: In function 'CnvDie':
CnvUtil.c:190: error: 'self' undeclared (first use in this function)
CnvUtil.c:191: error: 'msg' undeclared (first use in this function)
CnvUtil.c: At top level:
CnvUtil.c:200: error: syntax error before 'self'
CnvUtil.c: In function 'CnvWarn':
CnvUtil.c:206: error: 'self' undeclared (first use in this function)
CnvUtil.c:207: error: 'msg' undeclared (first use in this function)
make[2]: *** [CnvUtil.o] Error 1
make[2]: Leaving directory `/home/pippijn/Programs/src/compile/crossfire/crossedit/Cnv'
make[1]: *** [all-recursive] Error 1
make[1]: Leaving directory `/home/pippijn/Programs/src/compile/crossfire/crossedit'
make: *** [all-recursive] Error 1