A4a
Test Message
Test WriteLine Message
00-01-00-00-00-FF-FF-FF-FF-01-00-00-00-00-00-00-00-04-01-00-00-00-29-53-79-73-74-65-6D-2E-53-65-63-75-72-69-74-79-2E-50-72-69-6E-63-69-70-61-6C-2E-47-65-6E-65-72-69-63-49-64-65-6E-74-69-74-79-02-00-00-00-06-6D-5F-6E-61-6D-65-06-6D-5F-74-79-70-65-01-01-06-02-00-00-00-04-6D-6F-6E-6F-06-03-00-00-00-03-64-6E-61-0B
00-01-00-00-00-FF-FF-FF-FF-01-00-00-00-00-00-00-00-04-01-00-00-00-2A-53-79-73-74-65-6D-2E-53-65-63-75-72-69-74-79-2E-50-72-69-6E-63-69-70-61-6C-2E-47-65-6E-65-72-69-63-50-72-69-6E-63-69-70-61-6C-02-00-00-00-0A-6D-5F-69-64-65-6E-74-69-74-79-07-6D-5F-72-6F-6C-65-73-03-06-29-53-79-73-74-65-6D-2E-53-65-63-75-72-69-74-79-2E-50-72-69-6E-63-69-70-61-6C-2E-47-65-6E-65-72-69-63-49-64-65-6E-74-69-74-79-09-02-00-00-00-09-03-00-00-00-04-02-00-00-00-29-53-79-73-74-65-6D-2E-53-65-63-75-72-69-74-79-2E-50-72-69-6E-63-69-70-61-6C-2E-47-65-6E-65-72-69-63-49-64-65-6E-74-69-74-79-02-00-00-00-06-6D-5F-6E-61-6D-65-06-6D-5F-74-79-70-65-01-01-06-04-00-00-00-04-6D-6F-6E-6F-06-05-00-00-00-03-64-6E-61-11-03-00-00-00-02-00-00-00-06-06-00-00-00-06-6D-6F-6E-6B-65-79-06-07-00-00-00-07-68-61-63-6B-65-72-73-0B
##### Unhandled Exception while running MonoTests.System.Threading.ThreadTest.TestApartment
System.Threading.ThreadAbortException: Thread was being aborted.
##### Unhandled Exception while running MonoTests.System.Threading.ThreadTest.TestPriority1
System.Threading.ThreadAbortException: Thread was being aborted.
##### Unhandled Exception while running MonoTests.System.Threading.ThreadTest.TestPriority2
System.Threading.ThreadAbortException: Thread was being aborted.
##### Unhandled Exception while running MonoTests.System.Threading.ThreadTest.TestPriority3
System.Threading.ThreadAbortException: Thread was being aborted.
##### Unhandled Exception while running MonoTests.System.Threading.ThreadTest.TestIsBackground1
System.Threading.ThreadAbortException: Thread was being aborted.
##### Unhandled Exception while running MonoTests.System.Threading.ThreadTest.TestIsBackground2
System.Threading.ThreadAbortException: Thread was being aborted.
##### Unhandled Exception while running MonoTests.System.Threading.ThreadTest.TestName
System.Threading.ThreadAbortException: Thread was being aborted.
##### Unhandled Exception while running MonoTests.System.Threading.ThreadTest.TestNestedThreads2
System.Threading.ThreadAbortException: Thread was being aborted.
##### Unhandled Exception while running MonoTests.System.Threading.ThreadTest.TestThreadState
System.Threading.ThreadAbortException: Thread was being aborted.
d:2
d:2
d:2
d:2
d:2
d:2
d:2
d:2
Tests run: 6139, Failures: 61, Not run: 42, Time: 122.3726504 seconds
Failures:
1) MonoTests.System.ActivatorTest.CreateInstance_Void : NotSupportedException was expected
2) MonoTests.System.AppDomainTest.Load_Loaded_Multiple : #B2
at MonoTests.System.AppDomainTest.Load_Loaded_Multiple()
3) MonoTests.System.ArrayTest.TestByteEnumArrayToIntArray : System.ArrayTypeMismatchException : Source array type cannot be assigned to destination array type.
at System.Array.Copy(Array sourceArray, Int32 sourceIndex, Array destinationArray, Int32 destinationIndex, Int32 length)
at System.Array.CopyTo(Array array, Int32 index)
at MonoTests.System.ArrayTest.TestByteEnumArrayToIntArray()
4) MonoTests.System.Diagnostics.StackFrameTest2.TestGetFileName2 : File name not null
at MonoTests.System.Diagnostics.StackFrameTest2.TestGetFileName2()
5) MonoTests.System.Diagnostics.StackFrameTest2.TestGetFileLineNumber : Line number (2)
expected:<132>
but was:<0>
at MonoTests.System.Diagnostics.StackFrameTest2.TestGetFileLineNumber()
6) MonoTests.System.Diagnostics.StackFrameTest2.TestGetFileColumnNumber : Column number (2)
expected:<4>
but was:<0>
at MonoTests.System.Diagnostics.StackFrameTest2.TestGetFileColumnNumber()
7) MonoTests.System.Diagnostics.StackFrameTest3.TestGetFileName : File name (2) should not be null
at MonoTests.System.Diagnostics.StackFrameTest3.TestGetFileName()
8) MonoTests.System.EnumTest.TestFormat_FormatSpecifier : #F_FSX:03
String lengths are both 2.
Strings differ at index 0.
expected:<"ff">
but was:<"FF">
-----------^
at MonoTests.System.EnumTest.TestFormat_FormatSpecifier()
9) MonoTests.System.Globalization.CompareInfoTest.CultureSensitiveCompare : #25(neg: 1)
at MonoTests.System.Globalization.CompareInfoTest.AssertCompare(String message, Int32 result, String s1, String s2, CompareOptions opt, CompareInfo ci)
at MonoTests.System.Globalization.CompareInfoTest.CultureSensitiveCompare()
10) MonoTests.System.Reflection.AssemblyNameTest.GetAssemblyName_CodeBase : #2
String lengths differ. Expected length=72, but was length=155.
Strings differ at index 8.
expected:<"file:///C:/cygwin/home/jschambe/mcs/class/c...">
but was:<"file:///c:/docume~1/jschambe/locals~1/temp/...">
-------------------^
at MonoTests.System.Reflection.AssemblyNameTest.GetAssemblyName_CodeBase()
11) MonoTests.System.Reflection.AssemblyTest.bug79872 : System.UnauthorizedAccessException : Access to the path "bug79872.dll" is denied.
at System.IO.Directory.DeleteHelper(String fullPath, String userPath, Boolean recursive)
at System.IO.Directory.Delete(String fullPath, String userPath, Boolean recursive)
at MonoTests.System.Reflection.AssemblyTest.bug79872()
12) MonoTests.System.Reflection.Emit.TypeBuilderTest.TestDefineMethod : System.ArgumentException : Interface method must be abstract and virtual.
at System.Reflection.Emit.TypeBuilder.DefineMethod(String name, MethodAttributes attributes, CallingConventions callingConvention, Type returnType, Type[] parameterTypes)
at MonoTests.System.Reflection.Emit.TypeBuilderTest.TestDefineMethod()
13) MonoTests.System.Security.Cryptography.CryptoConfigTest.CreateFromName_UpperCase : System.NullReferenceException : Object reference not set to an instance of an object.
at MonoTests.System.Security.Cryptography.CryptoConfigTest.CreateFromName_UpperCase()
14) MonoTests.System.Security.Cryptography.CryptoConfigTest.CreateFromName_LowerCase : System.NullReferenceException : Object reference not set to an instance of an object.
at MonoTests.System.Security.Cryptography.CryptoConfigTest.CreateFromName_LowerCase()
15) MonoTests.System.Security.Cryptography.CryptoConfigTest.CreateFromName_MixedCase : System.NullReferenceException : Object reference not set to an instance of an object.
at MonoTests.System.Security.Cryptography.CryptoConfigTest.CreateFromName_MixedCase()
16) MonoTests.System.Security.Cryptography.CryptoConfigTest.MapNameToOID_UpperCase : oid(SYSTEM.SECURITY.CRYPTOGRAPHY.MD5CRYPTOSERVICEPROVIDER)
expected:<"1.2.840.113549.2.5">
but was:<(null)>
at MonoTests.System.Security.Cryptography.CryptoConfigTest.MapNameToOID_UpperCase()
17) MonoTests.System.Security.Cryptography.CryptoConfigTest.MapNameToOID_LowerCase : oid(sha1)
expected:<"1.3.14.3.2.26">
but was:<(null)>
at MonoTests.System.Security.Cryptography.CryptoConfigTest.MapNameToOID_LowerCase()
18) MonoTests.System.Security.Cryptography.CryptoConfigTest.MapNameToOID_MixedCase : oid(sHa1)
expected:<"1.3.14.3.2.26">
but was:<(null)>
at MonoTests.System.Security.Cryptography.CryptoConfigTest.MapNameToOID_MixedCase()
19) MonoTests.System.Security.Cryptography.DESTransformTest.DontDecryptMultipleBlock_CBC_PKCS7 : Expected: CryptographicException but was IndexOutOfRangeException
at System.Buffer.InternalBlockCopy(Array src, Int32 srcOffset, Array dst, Int32 dstOffset, Int32 count)
at System.Security.Cryptography.CryptoAPITransform.TransformBlock(Byte[] inputBuffer, Int32 inputOffset, Int32 inputCount, Byte[] outputBuffer, Int32 outputOffset)
at MonoTests.System.Security.Cryptography.SymmetricAlgorithmTransformTest.DontDecryptMultipleBlock(CipherMode mode, PaddingMode padding)
at MonoTests.System.Security.Cryptography.SymmetricAlgorithmTransformTest.DontDecryptMultipleBlock_CBC_PKCS7()
20) MonoTests.System.Security.Cryptography.DESTransformTest.DontDecryptMultipleBlock_CFB_PKCS7 : Expected: CryptographicException but was IndexOutOfRangeException
at System.Buffer.InternalBlockCopy(Array src, Int32 srcOffset, Array dst, Int32 dstOffset, Int32 count)
at System.Security.Cryptography.CryptoAPITransform.TransformBlock(Byte[] inputBuffer, Int32 inputOffset, Int32 inputCount, Byte[] outputBuffer, Int32 outputOffset)
at MonoTests.System.Security.Cryptography.SymmetricAlgorithmTransformTest.DontDecryptMultipleBlock(CipherMode mode, PaddingMode padding)
at MonoTests.System.Security.Cryptography.SymmetricAlgorithmTransformTest.DontDecryptMultipleBlock_CFB_PKCS7()
21) MonoTests.System.Security.Cryptography.DESTransformTest.DontDecryptMultipleBlock_ECB_PKCS7 : Expected: CryptographicException but was IndexOutOfRangeException
at System.Buffer.InternalBlockCopy(Array src, Int32 srcOffset, Array dst, Int32 dstOffset, Int32 count)
at System.Security.Cryptography.CryptoAPITransform.TransformBlock(Byte[] inputBuffer, Int32 inputOffset, Int32 inputCount, Byte[] outputBuffer, Int32 outputOffset)
at MonoTests.System.Security.Cryptography.SymmetricAlgorithmTransformTest.DontDecryptMultipleBlock(CipherMode mode, PaddingMode padding)
at MonoTests.System.Security.Cryptography.SymmetricAlgorithmTransformTest.DontDecryptMultipleBlock_ECB_PKCS7()
22) MonoTests.System.Security.Cryptography.DESTransformTest.DontDecryptMultipleBlock_Final_CBC_PKCS7 : Expected: CryptographicException but was IndexOutOfRangeException
at System.Buffer.InternalBlockCopy(Array src, Int32 srcOffset, Array dst, Int32 dstOffset, Int32 count)
at System.Security.Cryptography.CryptoAPITransform.TransformBlock(Byte[] inputBuffer, Int32 inputOffset, Int32 inputCount, Byte[] outputBuffer, Int32 outputOffset)
at MonoTests.System.Security.Cryptography.SymmetricAlgorithmTransformTest.DontDecryptMultipleBlock_Final(CipherMode mode, PaddingMode padding)
at MonoTests.System.Security.Cryptography.SymmetricAlgorithmTransformTest.DontDecryptMultipleBlock_Final_CBC_PKCS7()
23) MonoTests.System.Security.Cryptography.DESTransformTest.DontDecryptMultipleBlock_Final_CFB_PKCS7 : Expected: CryptographicException but was IndexOutOfRangeException
at System.Buffer.InternalBlockCopy(Array src, Int32 srcOffset, Array dst, Int32 dstOffset, Int32 count)
at System.Security.Cryptography.CryptoAPITransform.TransformBlock(Byte[] inputBuffer, Int32 inputOffset, Int32 inputCount, Byte[] outputBuffer, Int32 outputOffset)
at MonoTests.System.Security.Cryptography.SymmetricAlgorithmTransformTest.DontDecryptMultipleBlock_Final(CipherMode mode, PaddingMode padding)
at MonoTests.System.Security.Cryptography.SymmetricAlgorithmTransformTest.DontDecryptMultipleBlock_Final_CFB_PKCS7()
24) MonoTests.System.Security.Cryptography.DESTransformTest.DontDecryptMultipleBlock_Final_ECB_PKCS7 : Expected: CryptographicException but was IndexOutOfRangeException
at System.Buffer.InternalBlockCopy(Array src, Int32 srcOffset, Array dst, Int32 dstOffset, Int32 count)
at System.Security.Cryptography.CryptoAPITransform.TransformBlock(Byte[] inputBuffer, Int32 inputOffset, Int32 inputCount, Byte[] outputBuffer, Int32 outputOffset)
at MonoTests.System.Security.Cryptography.SymmetricAlgorithmTransformTest.DontDecryptMultipleBlock_Final(CipherMode mode, PaddingMode padding)
at MonoTests.System.Security.Cryptography.SymmetricAlgorithmTransformTest.DontDecryptMultipleBlock_Final_ECB_PKCS7()
25) MonoTests.System.Security.Cryptography.RC2TransformTest.DontDecryptMultipleBlock_CBC_PKCS7 : Expected: CryptographicException but was IndexOutOfRangeException
at System.Buffer.InternalBlockCopy(Array src, Int32 srcOffset, Array dst, Int32 dstOffset, Int32 count)
at System.Security.Cryptography.CryptoAPITransform.TransformBlock(Byte[] inputBuffer, Int32 inputOffset, Int32 inputCount, Byte[] outputBuffer, Int32 outputOffset)
at MonoTests.System.Security.Cryptography.SymmetricAlgorithmTransformTest.DontDecryptMultipleBlock(CipherMode mode, PaddingMode padding)
at MonoTests.System.Security.Cryptography.SymmetricAlgorithmTransformTest.DontDecryptMultipleBlock_CBC_PKCS7()
26) MonoTests.System.Security.Cryptography.RC2TransformTest.DontDecryptMultipleBlock_CFB_PKCS7 : Expected: CryptographicException but was IndexOutOfRangeException
at System.Buffer.InternalBlockCopy(Array src, Int32 srcOffset, Array dst, Int32 dstOffset, Int32 count)
at System.Security.Cryptography.CryptoAPITransform.TransformBlock(Byte[] inputBuffer, Int32 inputOffset, Int32 inputCount, Byte[] outputBuffer, Int32 outputOffset)
at MonoTests.System.Security.Cryptography.SymmetricAlgorithmTransformTest.DontDecryptMultipleBlock(CipherMode mode, PaddingMode padding)
at MonoTests.System.Security.Cryptography.SymmetricAlgorithmTransformTest.DontDecryptMultipleBlock_CFB_PKCS7()
27) MonoTests.System.Security.Cryptography.RC2TransformTest.DontDecryptMultipleBlock_ECB_PKCS7 : Expected: CryptographicException but was IndexOutOfRangeException
at System.Buffer.InternalBlockCopy(Array src, Int32 srcOffset, Array dst, Int32 dstOffset, Int32 count)
at System.Security.Cryptography.CryptoAPITransform.TransformBlock(Byte[] inputBuffer, Int32 inputOffset, Int32 inputCount, Byte[] outputBuffer, Int32 outputOffset)
at MonoTests.System.Security.Cryptography.SymmetricAlgorithmTransformTest.DontDecryptMultipleBlock(CipherMode mode, PaddingMode padding)
at MonoTests.System.Security.Cryptography.SymmetricAlgorithmTransformTest.DontDecryptMultipleBlock_ECB_PKCS7()
28) MonoTests.System.Security.Cryptography.RC2TransformTest.DontDecryptMultipleBlock_Final_CBC_PKCS7 : Expected: CryptographicException but was IndexOutOfRangeException
at System.Buffer.InternalBlockCopy(Array src, Int32 srcOffset, Array dst, Int32 dstOffset, Int32 count)
at System.Security.Cryptography.CryptoAPITransform.TransformBlock(Byte[] inputBuffer, Int32 inputOffset, Int32 inputCount, Byte[] outputBuffer, Int32 outputOffset)
at MonoTests.System.Security.Cryptography.SymmetricAlgorithmTransformTest.DontDecryptMultipleBlock_Final(CipherMode mode, PaddingMode padding)
at MonoTests.System.Security.Cryptography.SymmetricAlgorithmTransformTest.DontDecryptMultipleBlock_Final_CBC_PKCS7()
29) MonoTests.System.Security.Cryptography.RC2TransformTest.DontDecryptMultipleBlock_Final_CFB_PKCS7 : Expected: CryptographicException but was IndexOutOfRangeException
at System.Buffer.InternalBlockCopy(Array src, Int32 srcOffset, Array dst, Int32 dstOffset, Int32 count)
at System.Security.Cryptography.CryptoAPITransform.TransformBlock(Byte[] inputBuffer, Int32 inputOffset, Int32 inputCount, Byte[] outputBuffer, Int32 outputOffset)
at MonoTests.System.Security.Cryptography.SymmetricAlgorithmTransformTest.DontDecryptMultipleBlock_Final(CipherMode mode, PaddingMode padding)
at MonoTests.System.Security.Cryptography.SymmetricAlgorithmTransformTest.DontDecryptMultipleBlock_Final_CFB_PKCS7()
30) MonoTests.System.Security.Cryptography.RC2TransformTest.DontDecryptMultipleBlock_Final_ECB_PKCS7 : Expected: CryptographicException but was IndexOutOfRangeException
at System.Buffer.InternalBlockCopy(Array src, Int32 srcOffset, Array dst, Int32 dstOffset, Int32 count)
at System.Security.Cryptography.CryptoAPITransform.TransformBlock(Byte[] inputBuffer, Int32 inputOffset, Int32 inputCount, Byte[] outputBuffer, Int32 outputOffset)
at MonoTests.System.Security.Cryptography.SymmetricAlgorithmTransformTest.DontDecryptMultipleBlock_Final(CipherMode mode, PaddingMode padding)
at MonoTests.System.Security.Cryptography.SymmetricAlgorithmTransformTest.DontDecryptMultipleBlock_Final_ECB_PKCS7()
31) MonoTests.System.Security.Cryptography.Rijndael128TransformTest.DontDecryptLastBlock_CFB_PKCS7 : System.Security.Cryptography.CryptographicException : Output feedback mode (OFB) is not supported by this implementation.
at System.Security.Cryptography.RijndaelManaged._NewEncryptor(Byte[] rgbKey, CipherMode mode, Byte[] rgbIV, Int32 feedbackSize)
at System.Security.Cryptography.RijndaelManaged.CreateEncryptor(Byte[] rgbKey, Byte[] rgbIV)
at System.Security.Cryptography.SymmetricAlgorithm.CreateEncryptor()
at MonoTests.System.Security.Cryptography.SymmetricAlgorithmTransformTest.DontDecryptLastBlock(CipherMode mode, PaddingMode padding)
at MonoTests.System.Security.Cryptography.SymmetricAlgorithmTransformTest.DontDecryptLastBlock_CFB_PKCS7()
32) MonoTests.System.Security.Cryptography.Rijndael128TransformTest.DontDecryptLastBlock_Final_CFB_None : System.Security.Cryptography.CryptographicException : Output feedback mode (OFB) is not supported by this implementation.
at System.Security.Cryptography.RijndaelManaged._NewEncryptor(Byte[] rgbKey, CipherMode mode, Byte[] rgbIV, Int32 feedbackSize)
at System.Security.Cryptography.RijndaelManaged.CreateEncryptor(Byte[] rgbKey, Byte[] rgbIV)
at System.Security.Cryptography.SymmetricAlgorithm.CreateEncryptor()
at MonoTests.System.Security.Cryptography.SymmetricAlgorithmTransformTest.DontDecryptLastBlock_Final(CipherMode mode, PaddingMode padding)
at MonoTests.System.Security.Cryptography.SymmetricAlgorithmTransformTest.DontDecryptLastBlock_Final_CFB_None()
33) MonoTests.System.Security.Cryptography.Rijndael128TransformTest.DontDecryptLastBlock_Final_CFB_PKCS7 : System.Security.Cryptography.CryptographicException : Output feedback mode (OFB) is not supported by this implementation.
at System.Security.Cryptography.RijndaelManaged._NewEncryptor(Byte[] rgbKey, CipherMode mode, Byte[] rgbIV, Int32 feedbackSize)
at System.Security.Cryptography.RijndaelManaged.CreateEncryptor(Byte[] rgbKey, Byte[] rgbIV)
at System.Security.Cryptography.SymmetricAlgorithm.CreateEncryptor()
at MonoTests.System.Security.Cryptography.SymmetricAlgorithmTransformTest.DontDecryptLastBlock_Final(CipherMode mode, PaddingMode padding)
at MonoTests.System.Security.Cryptography.SymmetricAlgorithmTransformTest.DontDecryptLastBlock_Final_CFB_PKCS7()
34) MonoTests.System.Security.Cryptography.Rijndael128TransformTest.DontDecryptLastBlock_Final_CFB_Zeros : System.Security.Cryptography.CryptographicException : Output feedback mode (OFB) is not supported by this implementation.
at System.Security.Cryptography.RijndaelManaged._NewEncryptor(Byte[] rgbKey, CipherMode mode, Byte[] rgbIV, Int32 feedbackSize)
at System.Security.Cryptography.RijndaelManaged.CreateEncryptor(Byte[] rgbKey, Byte[] rgbIV)
at System.Security.Cryptography.SymmetricAlgorithm.CreateEncryptor()
at MonoTests.System.Security.Cryptography.SymmetricAlgorithmTransformTest.DontDecryptLastBlock_Final(CipherMode mode, PaddingMode padding)
at MonoTests.System.Security.Cryptography.SymmetricAlgorithmTransformTest.DontDecryptLastBlock_Final_CFB_Zeros()
35) MonoTests.System.Security.Cryptography.Rijndael128TransformTest.CreateEncryptor_TransformBlock_One : System.Security.Cryptography.CryptographicException : Output feedback mode (OFB) is not supported by this implementation.
at System.Security.Cryptography.RijndaelManaged._NewEncryptor(Byte[] rgbKey, CipherMode mode, Byte[] rgbIV, Int32 feedbackSize)
at System.Security.Cryptography.RijndaelManaged.CreateEncryptor(Byte[] rgbKey, Byte[] rgbIV)
at System.Security.Cryptography.SymmetricAlgorithm.CreateEncryptor()
at MonoTests.System.Security.Cryptography.SymmetricAlgorithmTransformTest.CreateEncryptor_TransformBlock_One()
36) MonoTests.System.Security.Cryptography.Rijndael128TransformTest.CreateDecryptor_TransformBlock_One : System.Security.Cryptography.CryptographicException : Output feedback mode (OFB) is not supported by this implementation.
at System.Security.Cryptography.RijndaelManaged._NewDecryptor(Byte[] rgbKey, CipherMode mode, Byte[] rgbIV, Int32 feedbackSize)
at System.Security.Cryptography.RijndaelManaged.CreateDecryptor(Byte[] rgbKey, Byte[] rgbIV)
at System.Security.Cryptography.SymmetricAlgorithm.CreateDecryptor()
at MonoTests.System.Security.Cryptography.SymmetricAlgorithmTransformTest.CreateDecryptor_TransformBlock_One()
37) MonoTests.System.Security.Cryptography.Rijndael192TransformTest.DontDecryptLastBlock_CFB_PKCS7 : System.Security.Cryptography.CryptographicException : Output feedback mode (OFB) is not supported by this implementation.
at System.Security.Cryptography.RijndaelManaged._NewEncryptor(Byte[] rgbKey, CipherMode mode, Byte[] rgbIV, Int32 feedbackSize)
at System.Security.Cryptography.RijndaelManaged.CreateEncryptor(Byte[] rgbKey, Byte[] rgbIV)
at System.Security.Cryptography.SymmetricAlgorithm.CreateEncryptor()
at MonoTests.System.Security.Cryptography.SymmetricAlgorithmTransformTest.DontDecryptLastBlock(CipherMode mode, PaddingMode padding)
at MonoTests.System.Security.Cryptography.SymmetricAlgorithmTransformTest.DontDecryptLastBlock_CFB_PKCS7()
38) MonoTests.System.Security.Cryptography.Rijndael192TransformTest.DontDecryptLastBlock_Final_CFB_None : System.Security.Cryptography.CryptographicException : Output feedback mode (OFB) is not supported by this implementation.
at System.Security.Cryptography.RijndaelManaged._NewEncryptor(Byte[] rgbKey, CipherMode mode, Byte[] rgbIV, Int32 feedbackSize)
at System.Security.Cryptography.RijndaelManaged.CreateEncryptor(Byte[] rgbKey, Byte[] rgbIV)
at System.Security.Cryptography.SymmetricAlgorithm.CreateEncryptor()
at MonoTests.System.Security.Cryptography.SymmetricAlgorithmTransformTest.DontDecryptLastBlock_Final(CipherMode mode, PaddingMode padding)
at MonoTests.System.Security.Cryptography.SymmetricAlgorithmTransformTest.DontDecryptLastBlock_Final_CFB_None()
39) MonoTests.System.Security.Cryptography.Rijndael192TransformTest.DontDecryptLastBlock_Final_CFB_PKCS7 : System.Security.Cryptography.CryptographicException : Output feedback mode (OFB) is not supported by this implementation.
at System.Security.Cryptography.RijndaelManaged._NewEncryptor(Byte[] rgbKey, CipherMode mode, Byte[] rgbIV, Int32 feedbackSize)
at System.Security.Cryptography.RijndaelManaged.CreateEncryptor(Byte[] rgbKey, Byte[] rgbIV)
at System.Security.Cryptography.SymmetricAlgorithm.CreateEncryptor()
at MonoTests.System.Security.Cryptography.SymmetricAlgorithmTransformTest.DontDecryptLastBlock_Final(CipherMode mode, PaddingMode padding)
at MonoTests.System.Security.Cryptography.SymmetricAlgorithmTransformTest.DontDecryptLastBlock_Final_CFB_PKCS7()
40) MonoTests.System.Security.Cryptography.Rijndael192TransformTest.DontDecryptLastBlock_Final_CFB_Zeros : System.Security.Cryptography.CryptographicException : Output feedback mode (OFB) is not supported by this implementation.
at System.Security.Cryptography.RijndaelManaged._NewEncryptor(Byte[] rgbKey, CipherMode mode, Byte[] rgbIV, Int32 feedbackSize)
at System.Security.Cryptography.RijndaelManaged.CreateEncryptor(Byte[] rgbKey, Byte[] rgbIV)
at System.Security.Cryptography.SymmetricAlgorithm.CreateEncryptor()
at MonoTests.System.Security.Cryptography.SymmetricAlgorithmTransformTest.DontDecryptLastBlock_Final(CipherMode mode, PaddingMode padding)
at MonoTests.System.Security.Cryptography.SymmetricAlgorithmTransformTest.DontDecryptLastBlock_Final_CFB_Zeros()
41) MonoTests.System.Security.Cryptography.Rijndael192TransformTest.CreateEncryptor_TransformBlock_One : System.Security.Cryptography.CryptographicException : Output feedback mode (OFB) is not supported by this implementation.
at System.Security.Cryptography.RijndaelManaged._NewEncryptor(Byte[] rgbKey, CipherMode mode, Byte[] rgbIV, Int32 feedbackSize)
at System.Security.Cryptography.RijndaelManaged.CreateEncryptor(Byte[] rgbKey, Byte[] rgbIV)
at System.Security.Cryptography.SymmetricAlgorithm.CreateEncryptor()
at MonoTests.System.Security.Cryptography.SymmetricAlgorithmTransformTest.CreateEncryptor_TransformBlock_One()
42) MonoTests.System.Security.Cryptography.Rijndael192TransformTest.CreateDecryptor_TransformBlock_One : System.Security.Cryptography.CryptographicException : Output feedback mode (OFB) is not supported by this implementation.
at System.Security.Cryptography.RijndaelManaged._NewDecryptor(Byte[] rgbKey, CipherMode mode, Byte[] rgbIV, Int32 feedbackSize)
at System.Security.Cryptography.RijndaelManaged.CreateDecryptor(Byte[] rgbKey, Byte[] rgbIV)
at System.Security.Cryptography.SymmetricAlgorithm.CreateDecryptor()
at MonoTests.System.Security.Cryptography.SymmetricAlgorithmTransformTest.CreateDecryptor_TransformBlock_One()
43) MonoTests.System.Security.Cryptography.Rijndael256TransformTest.DontDecryptLastBlock_CFB_PKCS7 : System.Security.Cryptography.CryptographicException : Output feedback mode (OFB) is not supported by this implementation.
at System.Security.Cryptography.RijndaelManaged._NewEncryptor(Byte[] rgbKey, CipherMode mode, Byte[] rgbIV, Int32 feedbackSize)
at System.Security.Cryptography.RijndaelManaged.CreateEncryptor(Byte[] rgbKey, Byte[] rgbIV)
at System.Security.Cryptography.SymmetricAlgorithm.CreateEncryptor()
at MonoTests.System.Security.Cryptography.SymmetricAlgorithmTransformTest.DontDecryptLastBlock(CipherMode mode, PaddingMode padding)
at MonoTests.System.Security.Cryptography.SymmetricAlgorithmTransformTest.DontDecryptLastBlock_CFB_PKCS7()
44) MonoTests.System.Security.Cryptography.Rijndael256TransformTest.DontDecryptLastBlock_Final_CFB_None : System.Security.Cryptography.CryptographicException : Output feedback mode (OFB) is not supported by this implementation.
at System.Security.Cryptography.RijndaelManaged._NewEncryptor(Byte[] rgbKey, CipherMode mode, Byte[] rgbIV, Int32 feedbackSize)
at System.Security.Cryptography.RijndaelManaged.CreateEncryptor(Byte[] rgbKey, Byte[] rgbIV)
at System.Security.Cryptography.SymmetricAlgorithm.CreateEncryptor()
at MonoTests.System.Security.Cryptography.SymmetricAlgorithmTransformTest.DontDecryptLastBlock_Final(CipherMode mode, PaddingMode padding)
at MonoTests.System.Security.Cryptography.SymmetricAlgorithmTransformTest.DontDecryptLastBlock_Final_CFB_None()
45) MonoTests.System.Security.Cryptography.Rijndael256TransformTest.DontDecryptLastBlock_Final_CFB_PKCS7 : System.Security.Cryptography.CryptographicException : Output feedback mode (OFB) is not supported by this implementation.
at System.Security.Cryptography.RijndaelManaged._NewEncryptor(Byte[] rgbKey, CipherMode mode, Byte[] rgbIV, Int32 feedbackSize)
at System.Security.Cryptography.RijndaelManaged.CreateEncryptor(Byte[] rgbKey, Byte[] rgbIV)
at System.Security.Cryptography.SymmetricAlgorithm.CreateEncryptor()
at MonoTests.System.Security.Cryptography.SymmetricAlgorithmTransformTest.DontDecryptLastBlock_Final(CipherMode mode, PaddingMode padding)
at MonoTests.System.Security.Cryptography.SymmetricAlgorithmTransformTest.DontDecryptLastBlock_Final_CFB_PKCS7()
46) MonoTests.System.Security.Cryptography.Rijndael256TransformTest.DontDecryptLastBlock_Final_CFB_Zeros : System.Security.Cryptography.CryptographicException : Output feedback mode (OFB) is not supported by this implementation.
at System.Security.Cryptography.RijndaelManaged._NewEncryptor(Byte[] rgbKey, CipherMode mode, Byte[] rgbIV, Int32 feedbackSize)
at System.Security.Cryptography.RijndaelManaged.CreateEncryptor(Byte[] rgbKey, Byte[] rgbIV)
at System.Security.Cryptography.SymmetricAlgorithm.CreateEncryptor()
at MonoTests.System.Security.Cryptography.SymmetricAlgorithmTransformTest.DontDecryptLastBlock_Final(CipherMode mode, PaddingMode padding)
at MonoTests.System.Security.Cryptography.SymmetricAlgorithmTransformTest.DontDecryptLastBlock_Final_CFB_Zeros()
47) MonoTests.System.Security.Cryptography.Rijndael256TransformTest.CreateEncryptor_TransformBlock_One : System.Security.Cryptography.CryptographicException : Output feedback mode (OFB) is not supported by this implementation.
at System.Security.Cryptography.RijndaelManaged._NewEncryptor(Byte[] rgbKey, CipherMode mode, Byte[] rgbIV, Int32 feedbackSize)
at System.Security.Cryptography.RijndaelManaged.CreateEncryptor(Byte[] rgbKey, Byte[] rgbIV)
at System.Security.Cryptography.SymmetricAlgorithm.CreateEncryptor()
at MonoTests.System.Security.Cryptography.SymmetricAlgorithmTransformTest.CreateEncryptor_TransformBlock_One()
48) MonoTests.System.Security.Cryptography.Rijndael256TransformTest.CreateDecryptor_TransformBlock_One : System.Security.Cryptography.CryptographicException : Output feedback mode (OFB) is not supported by this implementation.
at System.Security.Cryptography.RijndaelManaged._NewDecryptor(Byte[] rgbKey, CipherMode mode, Byte[] rgbIV, Int32 feedbackSize)
at System.Security.Cryptography.RijndaelManaged.CreateDecryptor(Byte[] rgbKey, Byte[] rgbIV)
at System.Security.Cryptography.SymmetricAlgorithm.CreateDecryptor()
at MonoTests.System.Security.Cryptography.SymmetricAlgorithmTransformTest.CreateDecryptor_TransformBlock_One()
49) MonoTests.System.Security.Cryptography.TripleDESTransformTest.DontDecryptMultipleBlock_CBC_PKCS7 : Expected: CryptographicException but was IndexOutOfRangeException
at System.Buffer.InternalBlockCopy(Array src, Int32 srcOffset, Array dst, Int32 dstOffset, Int32 count)
at System.Security.Cryptography.CryptoAPITransform.TransformBlock(Byte[] inputBuffer, Int32 inputOffset, Int32 inputCount, Byte[] outputBuffer, Int32 outputOffset)
at MonoTests.System.Security.Cryptography.SymmetricAlgorithmTransformTest.DontDecryptMultipleBlock(CipherMode mode, PaddingMode padding)
at MonoTests.System.Security.Cryptography.SymmetricAlgorithmTransformTest.DontDecryptMultipleBlock_CBC_PKCS7()
50) MonoTests.System.Security.Cryptography.TripleDESTransformTest.DontDecryptMultipleBlock_CFB_PKCS7 : Expected: CryptographicException but was IndexOutOfRangeException
at System.Buffer.InternalBlockCopy(Array src, Int32 srcOffset, Array dst, Int32 dstOffset, Int32 count)
at System.Security.Cryptography.CryptoAPITransform.TransformBlock(Byte[] inputBuffer, Int32 inputOffset, Int32 inputCount, Byte[] outputBuffer, Int32 outputOffset)
at MonoTests.System.Security.Cryptography.SymmetricAlgorithmTransformTest.DontDecryptMultipleBlock(CipherMode mode, PaddingMode padding)
at MonoTests.System.Security.Cryptography.SymmetricAlgorithmTransformTest.DontDecryptMultipleBlock_CFB_PKCS7()
51) MonoTests.System.Security.Cryptography.TripleDESTransformTest.DontDecryptMultipleBlock_ECB_PKCS7 : Expected: CryptographicException but was IndexOutOfRangeException
at System.Buffer.InternalBlockCopy(Array src, Int32 srcOffset, Array dst, Int32 dstOffset, Int32 count)
at System.Security.Cryptography.CryptoAPITransform.TransformBlock(Byte[] inputBuffer, Int32 inputOffset, Int32 inputCount, Byte[] outputBuffer, Int32 outputOffset)
at MonoTests.System.Security.Cryptography.SymmetricAlgorithmTransformTest.DontDecryptMultipleBlock(CipherMode mode, PaddingMode padding)
at MonoTests.System.Security.Cryptography.SymmetricAlgorithmTransformTest.DontDecryptMultipleBlock_ECB_PKCS7()
52) MonoTests.System.Security.Cryptography.TripleDESTransformTest.DontDecryptMultipleBlock_Final_CBC_PKCS7 : Expected: CryptographicException but was IndexOutOfRangeException
at System.Buffer.InternalBlockCopy(Array src, Int32 srcOffset, Array dst, Int32 dstOffset, Int32 count)
at System.Security.Cryptography.CryptoAPITransform.TransformBlock(Byte[] inputBuffer, Int32 inputOffset, Int32 inputCount, Byte[] outputBuffer, Int32 outputOffset)
at MonoTests.System.Security.Cryptography.SymmetricAlgorithmTransformTest.DontDecryptMultipleBlock_Final(CipherMode mode, PaddingMode padding)
at MonoTests.System.Security.Cryptography.SymmetricAlgorithmTransformTest.DontDecryptMultipleBlock_Final_CBC_PKCS7()
53) MonoTests.System.Security.Cryptography.TripleDESTransformTest.DontDecryptMultipleBlock_Final_CFB_PKCS7 : Expected: CryptographicException but was IndexOutOfRangeException
at System.Buffer.InternalBlockCopy(Array src, Int32 srcOffset, Array dst, Int32 dstOffset, Int32 count)
at System.Security.Cryptography.CryptoAPITransform.TransformBlock(Byte[] inputBuffer, Int32 inputOffset, Int32 inputCount, Byte[] outputBuffer, Int32 outputOffset)
at MonoTests.System.Security.Cryptography.SymmetricAlgorithmTransformTest.DontDecryptMultipleBlock_Final(CipherMode mode, PaddingMode padding)
at MonoTests.System.Security.Cryptography.SymmetricAlgorithmTransformTest.DontDecryptMultipleBlock_Final_CFB_PKCS7()
54) MonoTests.System.Security.Cryptography.TripleDESTransformTest.DontDecryptMultipleBlock_Final_ECB_PKCS7 : Expected: CryptographicException but was IndexOutOfRangeException
at System.Buffer.InternalBlockCopy(Array src, Int32 srcOffset, Array dst, Int32 dstOffset, Int32 count)
at System.Security.Cryptography.CryptoAPITransform.TransformBlock(Byte[] inputBuffer, Int32 inputOffset, Int32 inputCount, Byte[] outputBuffer, Int32 outputOffset)
at MonoTests.System.Security.Cryptography.SymmetricAlgorithmTransformTest.DontDecryptMultipleBlock_Final(CipherMode mode, PaddingMode padding)
at MonoTests.System.Security.Cryptography.SymmetricAlgorithmTransformTest.DontDecryptMultipleBlock_Final_ECB_PKCS7()
55) MonoTests.System.Security.Permissions.FileIOPermissionAttributeTest.All : All=FileIOPermissionAttribute-Append
String lengths differ. Expected length=138, but was length=158.
Strings differ at index 3.
expected:<"c:\docume~1\jschambe\locals~1\temp\nun...">
but was:<"c:\Documents and Settings\jschambe\Loc...">
--------------^
at MonoTests.System.Security.Permissions.FileIOPermissionAttributeTest.All()
56) MonoTests.System.Security.Permissions.FileIOPermissionAttributeTest.Append : Append=FileIOPermissionAttribute-Append
String lengths differ. Expected length=138, but was length=158.
Strings differ at index 3.
expected:<"c:\docume~1\jschambe\locals~1\temp\nun...">
but was:<"c:\Documents and Settings\jschambe\Loc...">
--------------^
at MonoTests.System.Security.Permissions.FileIOPermissionAttributeTest.Append()
57) MonoTests.System.Security.Permissions.FileIOPermissionAttributeTest.PathDiscovery : PathDiscovery=FileIOPermissionAttribute-PathDiscovery
String lengths differ. Expected length=138, but was length=158.
Strings differ at index 3.
expected:<"c:\docume~1\jschambe\locals~1\temp\nun...">
but was:<"c:\Documents and Settings\jschambe\Loc...">
--------------^
at MonoTests.System.Security.Permissions.FileIOPermissionAttributeTest.PathDiscovery()
58) MonoTests.System.Security.Permissions.FileIOPermissionAttributeTest.Read : PathDiscovery=FileIOPermissionAttribute-Read
String lengths differ. Expected length=138, but was length=158.
Strings differ at index 3.
expected:<"c:\docume~1\jschambe\locals~1\temp\nun...">
but was:<"c:\Documents and Settings\jschambe\Loc...">
--------------^
at MonoTests.System.Security.Permissions.FileIOPermissionAttributeTest.Read()
59) MonoTests.System.Security.Permissions.FileIOPermissionAttributeTest.Write : PathDiscovery=FileIOPermissionAttribute-Write
String lengths differ. Expected length=138, but was length=158.
Strings differ at index 3.
expected:<"c:\docume~1\jschambe\locals~1\temp\nun...">
but was:<"c:\Documents and Settings\jschambe\Loc...">
--------------^
at MonoTests.System.Security.Permissions.FileIOPermissionAttributeTest.Write()
60) MonoTests.System.Security.Permissions.FileIOPermissionTest.Union_Partial : 3.Length
expected:<2>
but was:<1>
at MonoTests.System.Security.Permissions.FileIOPermissionTest.Partial(String msg, String[] path1, String[] path2, Int32 expected)
at MonoTests.System.Security.Permissions.FileIOPermissionTest.Union_Partial()
61) MonoTests.System.TimeZoneTest.TestCtors : B03
String lengths are both 19.
Strings differ at index 1.
expected:<"04/07/2002 02:00:00">
but was:<"03/10/2002 02:00:00">
------------^
at MonoTests.System.TimeZoneTest.EST(TimeZone t1)
at MonoTests.System.TimeZoneTest.TestCtors()
Tests not run:
1) MonoTests.System.CharCategoryTest.IsLetter : The dump file is huge, so avoided this test way.
2) MonoTests.System.CharCategoryTest.IsLetterOrDigit : The dump file is huge, so avoided this test way.
3) MonoTests.System.DateTimeTest.TestParse2 : need to fix tests that run on different timezones
4) MonoTests.System.DateTimeTest.ParseNotExact : Works only under MS 1.x (not Mono or MS 2.0).
5) MonoTests.System.Diagnostics.StackTraceTest.StackTrace_Thread_Null : Not supported in Mono
6) MonoTests.System.Diagnostics.StackTraceTest.StackTrace_Thread_Suspended : Not supported in Mono
7) MonoTests.System.IO.DirectoryTest.MoveException4 : On IA64, causes nunit to abort due to bug #76388
8) MonoTests.System.IO.PathTest.TestGetFullPath : This does not work under windows. See ERROR comments below.
9) MonoTests.System.Reflection.Emit.FieldBuilderTest.TestGetCustomAttributesComplete : mono supports this
10) MonoTests.System.Reflection.Emit.FieldBuilderTest.TestGetCustomAttributesOfTypeComplete : mono supports this
11) MonoTests.System.Reflection.Emit.TypeBuilderTest.TestGetEventsIncomplete : mcs depends on this
12) MonoTests.System.Reflection.Emit.TypeBuilderTest.TestGetEventsFlagsIncomplete : mcs depends on this
13) MonoTests.System.Reflection.Emit.TypeBuilderTest.TestGetEventIncomplete : mcs depends on this
14) MonoTests.System.Reflection.Emit.TypeBuilderTest.TestGetEventFlagsIncomplete : mcs depends on this
15) MonoTests.System.Reflection.Emit.TypeBuilderTest.TestGetFieldsIncomplete : mcs depends on this
16) MonoTests.System.Reflection.Emit.TypeBuilderTest.TestGetFieldsFlagsIncomplete : mcs depends on this
17) MonoTests.System.Reflection.Emit.TypeBuilderTest.TestGetFieldIncomplete : mcs depends on this
18) MonoTests.System.Reflection.Emit.TypeBuilderTest.TestGetFieldFlagsIncomplete : mcs depends on this
19) MonoTests.System.Reflection.Emit.TypeBuilderTest.TestGetPropertiesIncomplete : mcs depends on this
20) MonoTests.System.Reflection.Emit.TypeBuilderTest.TestGetPropertiesFlagsIncomplete : mcs depends on this
21) MonoTests.System.Reflection.Emit.TypeBuilderTest.TestGetMethodsIncomplete : mcs depends on this
22) MonoTests.System.Reflection.Emit.TypeBuilderTest.TestGetMethodsFlagsIncomplete : mcs depends on this
23) MonoTests.System.Resources.ResourceReaderTest.ConstructorString_Bad : Not covered in the docs, not sure what the correct behavior should be for this
24) MonoTests.System.Security.Cryptography.DSACryptoServiceProviderTest.KeyGeneration : Much too long (with MS as Mono doesn't generates the keypair unless it need it)
25) MonoTests.System.Security.Cryptography.RSACryptoServiceProviderTest.KeyGeneration : Much too long (with MS as Mono doesn't generates the keypair unless it need it)
26) MonoTests.System.Security.Permissions.FileIOPermissionTest.ShortToLong : should compatibility go that far ?
27) MonoTests.System.Security.Permissions.PublisherIdentityPermissionAttributeTest.SignedFile : CreateFromSignedFile isn't finished yet
28) MonoTests.System.Security.PermissionSetTest.ConvertPermissionSet_BinaryToBinary : Don't know why it doesn't work under Fx 1.1
29) MonoTests.System.Security.PermissionSetTest.ConvertPermissionSet_XmlToBinary : Don't know why it doesn't work under Fx 1.1
30) MonoTests.System.StringTest.TestSbytePtrConstructorOverflow1 : Blocked by mcs bug 78899
31) MonoTests.System.StringTest.TestSbytePtrConstructorOverflow2 : Blocked by mcs bug 78899
32) MonoTests.System.StringTest.TestSbytePtrConstructorOverflow3 : Blocked by mcs bug 78899
33) MonoTests.System.StringTest.TestSbytePtrConstructorOverflow4 : Blocked by mcs bug 78899
34) MonoTests.System.StringTest.TestSbytePtrConstructorOverflow5 : Blocked by mcs bug 78899
35) MonoTests.System.StringTest.TestSbytePtrConstructorOverflow6 : Blocked by mcs bug 78899
36) MonoTests.System.Threading.MutexTest.TestWaitAndFoget1 : It hangs and breaks the domain which runs nunit-console itself
37) MonoTests.System.Threading.ThreadTest.CurrentPrincipal_PrincipalPolicy_NoPrincipal : see comment below.
38) MonoTests.System.Threading.ThreadTest.CurrentPrincipal_PrincipalPolicy_UnauthenticatedPrincipal : see comment below.
39) MonoTests.System.TimeSpanTest.MaxHours_TooLong : too long
40) MonoTests.System.TimeSpanTest.MinHours_TooLong : too long
41) MonoTests.System.TimeSpanTest.MaxMinutes_TooLong : too long
42) MonoTests.System.TimeSpanTest.MinMinutes_TooLong : too long