------ Build started: Project: jerod.call.3.19.07.turnin, Configuration: Debug Win32 ------
Compiling...
jerod.call.3.19.07.cpp
c:\ars\homework\3.19.turnin\jerod.call.3.19.07.turnin\jerod.call.3.19.07.turnin\jerod.call.3.19.07.cpp(32) : error C2664: 'std::basic_string<_Elem,_Traits,_Ax>::basic_string(std::basic_string<_Elem,_Traits,_Ax>::_Has_debug_it)' : cannot convert parameter 1 from 'int' to 'std::basic_string<_Elem,_Traits,_Ax>::_Has_debug_it'
with
[
_Elem=char,
_Traits=std::char_traits<char>,
_Ax=std::allocator<char>
]
Constructor for struct 'std::basic_string<_Elem,_Traits,_Ax>::_Has_debug_it' is declared 'explicit'
with
[
_Elem=char,
_Traits=std::char_traits<char>,
_Ax=std::allocator<char>
]
c:\ars\homework\3.19.turnin\jerod.call.3.19.07.turnin\jerod.call.3.19.07.turnin\jerod.call.3.19.07.cpp(33) : error C2664: 'std::basic_string<_Elem,_Traits,_Ax>::basic_string(std::basic_string<_Elem,_Traits,_Ax>::_Has_debug_it)' : cannot convert parameter 1 from 'int' to 'std::basic_string<_Elem,_Traits,_Ax>::_Has_debug_it'
with
[
_Elem=char,
_Traits=std::char_traits<char>,
_Ax=std::allocator<char>
]
Constructor for struct 'std::basic_string<_Elem,_Traits,_Ax>::_Has_debug_it' is declared 'explicit'
with
[
_Elem=char,
_Traits=std::char_traits<char>,
_Ax=std::allocator<char>
]
c:\ars\homework\3.19.turnin\jerod.call.3.19.07.turnin\jerod.call.3.19.07.turnin\jerod.call.3.19.07.cpp(39) : error C3861: 'sum': identifier not found
c:\ars\homework\3.19.turnin\jerod.call.3.19.07.turnin\jerod.call.3.19.07.turnin\jerod.call.3.19.07.cpp(47) : warning C4267: 'initializing' : conversion from 'size_t' to 'int', possible loss of data
c:\ars\homework\3.19.turnin\jerod.call.3.19.07.turnin\jerod.call.3.19.07.turnin\jerod.call.3.19.07.cpp(52) : error C2440: 'type cast' : cannot convert from 'char' to 'std::string'
No constructor could take the source type, or constructor overload resolution was ambiguous
c:\ars\homework\3.19.turnin\jerod.call.3.19.07.turnin\jerod.call.3.19.07.turnin\jerod.call.3.19.07.cpp(52) : error C2143: syntax error : missing ';' before '}'
c:\ars\homework\3.19.turnin\jerod.call.3.19.07.turnin\jerod.call.3.19.07.turnin\jerod.call.3.19.07.cpp(70) : warning C4018: '<' : signed/unsigned mismatch
c:\ars\homework\3.19.turnin\jerod.call.3.19.07.turnin\jerod.call.3.19.07.turnin\jerod.call.3.19.07.cpp(79) : error C2440: 'type cast' : cannot convert from 'int' to 'std::string'
No constructor could take the source type, or constructor overload resolution was ambiguous
c:\ars\homework\3.19.turnin\jerod.call.3.19.07.turnin\jerod.call.3.19.07.turnin\jerod.call.3.19.07.cpp(83) : error C2440: 'type cast' : cannot convert from 'int' to 'std::string'
No constructor could take the source type, or constructor overload resolution was ambiguous
Build log was saved at "file://c:\ars\homework\3.19.turnin\jerod.call.3.19.07.turnin\jerod.call.3.19.07.turnin\Debug\BuildLog.htm"
jerod.call.3.19.07.turnin - 7 error(s), 2 warning(s)
========== Build: 0 succeeded, 1 failed, 0 up-to-date, 0 skipped ==========