All pastes #400773 Raw Edit

Mine

public text v1 · immutable
·published 2007-03-18 22:08 UTC
rendered paste body
[Nat@localhost Clooper]$ make aclient.so
g++ -I/home/james/cvs/sugar-jhbuild/build/include/python2.5 -I/usr/include/python2.4 -g -Wall -Werror  -fPIC -O3 -finline -shared -o aclient.so aclient.cpp -lasound  -L/usr/local/lib -lcsound -L/home/james/cvs/sugar-jhbuild/build/lib 
aclient.cpp:1:20: error: Python.h: No such file or directory
aclient.cpp:14:27: error: csound/csound.h: No such file or directory
aclient.cpp:41: error: ‘MYFLT’ does not name a type
aclient.cpp:42: error: ‘MYFLT’ does not name a type
aclient.cpp:43: error: ‘MYFLT’ was not declared in this scope
aclient.cpp:43: error: template argument 1 is invalid
aclient.cpp:43: error: template argument 2 is invalid
aclient.cpp:45: error: ‘MYFLT’ has not been declared
aclient.cpp:70: error: ‘MYFLT’ has not been declared
aclient.cpp:104: error: ‘CSOUND’ has not been declared
aclient.cpp:104: error: ‘MYFLT’ has not been declared
aclient.cpp: In constructor ‘ev_t::ev_t(char, int*, int, bool, bool)’:
aclient.cpp:50: error: ‘duration’ was not declared in this scope
aclient.cpp:51: error: ‘attack’ was not declared in this scope
aclient.cpp:52: error: ‘decay’ was not declared in this scope
aclient.cpp:53: error: ‘prev_secs_per_tick’ was not declared in this scope
aclient.cpp:54: error: invalid types ‘int[int]’ for array subscript
aclient.cpp:56: error: invalid types ‘int[int]’ for array subscript
aclient.cpp: In member function ‘void ev_t::ev_print(FILE*)’:
aclient.cpp:67: error: request for member ‘size’ in ‘((ev_t*)this)->ev_t::param’, which is of non-class type ‘int’
aclient.cpp:67: error: invalid types ‘int[size_t]’ for array subscript
aclient.cpp: In member function ‘void ev_t::update(int, int)’:
aclient.cpp:72: error: request for member ‘size’ in ‘((ev_t*)this)->ev_t::param’, which is of non-class type ‘int’
aclient.cpp:82: error: ‘duration’ was not declared in this scope
aclient.cpp:83: error: ‘attack’ was not declared in this scope
aclient.cpp:84: error: ‘decay’ was not declared in this scope
aclient.cpp:85: error: invalid types ‘int[int]’ for array subscript
aclient.cpp:87: error: ‘prev_secs_per_tick’ was not declared in this scope
aclient.cpp:91: error: invalid types ‘int[int]’ for array subscript
aclient.cpp: In member function ‘void ev_t::event(int*, int)’:
aclient.cpp:108: error: ‘prev_secs_per_tick’ was not declared in this scope
aclient.cpp:110: error: invalid types ‘int[int]’ for array subscript
aclient.cpp:110: error: ‘duration’ was not declared in this scope
aclient.cpp:111: error: request for member ‘size’ in ‘((ev_t*)this)->ev_t::param’, which is of non-class type ‘int’
aclient.cpp:111: error: invalid types ‘int[int]’ for array subscript
aclient.cpp:111: error: ‘attack’ was not declared in this scope
aclient.cpp:111: error: invalid types ‘int[int]’ for array subscript
aclient.cpp:112: error: request for member ‘size’ in ‘((ev_t*)this)->ev_t::param’, which is of non-class type ‘int’
aclient.cpp:112: error: invalid types ‘int[int]’ for array subscript
aclient.cpp:112: error: ‘decay’ was not declared in this scope
aclient.cpp:112: error: invalid types ‘int[int]’ for array subscript
aclient.cpp:114: error: invalid types ‘int[int]’ for array subscript
aclient.cpp:116: error: invalid types ‘int[int]’ for array subscript
aclient.cpp:116: error: request for member ‘size’ in ‘((ev_t*)this)->ev_t::param’, which is of non-class type ‘int’
aclient.cpp:116: error: ‘csoundScoreEvent’ was not declared in this scope
aclient.cpp: At global scope:
aclient.cpp:307: error: ISO C++ forbids declaration of ‘CSOUND’ with no type
aclient.cpp:307: error: expected ‘;’ before ‘*’ token
aclient.cpp:314: error: ‘MYFLT’ does not name a type
aclient.cpp:315: error: ‘MYFLT’ does not name a type
aclient.cpp:316: error: ‘MYFLT’ does not name a type
aclient.cpp:324: error: ISO C++ forbids declaration of ‘CSOUND’ with no type
aclient.cpp:324: error: expected ‘;’ before ‘*’ token
aclient.cpp:329: error: expected `)' before ‘*’ token
aclient.cpp:387: error: ‘MYFLT’ has not been declared
aclient.cpp:436: error: ‘MYFLT’ has not been declared
aclient.cpp:690: error: ‘MYFLT’ has not been declared
aclient.cpp:728: error: ‘MYFLT’ has not been declared
aclient.cpp:748: error: ‘MYFLT’ has not been declared
aclient.cpp:771: error: ‘MYFLT’ has not been declared
aclient.cpp:791: error: ‘MYFLT’ has not been declared
aclient.cpp: In destructor ‘TamTamSound::EvLoop::~EvLoop()’:
aclient.cpp:336: error: ‘csoundLockMutex’ was not declared in this scope
aclient.cpp:341: error: ‘csoundUnlockMutex’ was not declared in this scope
aclient.cpp:342: error: ‘csoundDestroyMutex’ was not declared in this scope
aclient.cpp: In member function ‘void TamTamSound::EvLoop::clear()’:
aclient.cpp:346: error: ‘csoundLockMutex’ was not declared in this scope
aclient.cpp:354: error: ‘csoundUnlockMutex’ was not declared in this scope
aclient.cpp: In member function ‘void TamTamSound::EvLoop::deactivateAll()’:
aclient.cpp:358: error: ‘csoundLockMutex’ was not declared in this scope
aclient.cpp:363: error: ‘csoundUnlockMutex’ was not declared in this scope
aclient.cpp: In member function ‘int TamTamSound::EvLoop::getTick()’:
aclient.cpp:367: error: ‘rtick’ was not declared in this scope
aclient.cpp: In member function ‘void TamTamSound::EvLoop::setNumTicks(int)’:
aclient.cpp:372: error: ‘rtick’ was not declared in this scope
aclient.cpp: In member function ‘void TamTamSound::EvLoop::setTick(int)’:
aclient.cpp:381: error: ‘rtick’ was not declared in this scope
aclient.cpp:381: error: ‘MYFLT’ was not declared in this scope
aclient.cpp:383: error: ‘csoundLockMutex’ was not declared in this scope
aclient.cpp:385: error: ‘csoundUnlockMutex’ was not declared in this scope
aclient.cpp: In member function ‘void TamTamSound::EvLoop::setTickDuration(int)’:
aclient.cpp:389: error: ‘csound’ was not declared in this scope
aclient.cpp:393: error: ‘secs_per_tick’ was not declared in this scope
aclient.cpp:394: error: ‘ticks_per_step’ was not declared in this scope
aclient.cpp: In member function ‘void TamTamSound::EvLoop::step()’:
aclient.cpp:399: error: ‘rtick’ was not declared in this scope
aclient.cpp:399: error: ‘ticks_per_step’ was not declared in this scope
aclient.cpp:403: error: ‘csoundLockMutex’ was not declared in this scope
aclient.cpp:415: error: ‘csound’ was not declared in this scope
aclient.cpp:415: error: ‘secs_per_tick’ was not declared in this scope
aclient.cpp:425: error: ‘csound’ was not declared in this scope
aclient.cpp:425: error: ‘secs_per_tick’ was not declared in this scope
aclient.cpp:431: error: ‘csoundUnlockMutex’ was not declared in this scope
aclient.cpp: In member function ‘void TamTamSound::EvLoop::addEvent(int, char, int*, int, bool, bool)’:
aclient.cpp:444: error: ‘csoundLockMutex’ was not declared in this scope
aclient.cpp:452: error: ‘csoundUnlockMutex’ was not declared in this scope
aclient.cpp: In member function ‘void TamTamSound::EvLoop::delEvent(int)’:
aclient.cpp:468: error: ‘csoundLockMutex’ was not declared in this scope
aclient.cpp:476: error: ‘csoundUnlockMutex’ was not declared in this scope
aclient.cpp: In member function ‘void TamTamSound::EvLoop::updateEvent(int, int, float, int)’:
aclient.cpp:489: error: ‘csoundLockMutex’ was not declared in this scope
cc1plus: warnings being treated as errors
aclient.cpp:493: warning: passing ‘float’ for argument 2 to ‘void ev_t::update(int, int)’
aclient.cpp:505: error: ‘csoundUnlockMutex’ was not declared in this scope
aclient.cpp: In constructor ‘TamTamSound::TamTamSound(char*, snd_pcm_uframes_t, unsigned int)’:
aclient.cpp:527: error: class ‘TamTamSound’ does not have any field named ‘csound’
aclient.cpp:546: error: ‘csound’ was not declared in this scope
aclient.cpp:546: error: ‘csoundCreate’ was not declared in this scope
aclient.cpp:555: error: ‘csoundPreCompile’ was not declared in this scope
aclient.cpp:556: error: ‘csoundSetHostImplementedAudioIO’ was not declared in this scope
aclient.cpp:557: error: ‘csoundCompile’ was not declared in this scope
aclient.cpp: In destructor ‘TamTamSound::~TamTamSound()’:
aclient.cpp:569: error: ‘csound’ was not declared in this scope
aclient.cpp:576: error: ‘csoundDestroy’ was not declared in this scope
aclient.cpp: In member function ‘uintptr_t TamTamSound::thread_fn()’:
aclient.cpp:582: error: ‘csound’ was not declared in this scope
aclient.cpp:586: error: ‘csoundGetOutputBufferSize’ was not declared in this scope
aclient.cpp:611: error: ‘csoundPerformBuffer’ was not declared in this scope
aclient.cpp:612: error: ‘csoundGetOutputBuffer’ was not declared in this scope
aclient.cpp:623: error: ‘csoundPerformBuffer’ was not declared in this scope
aclient.cpp:624: error: ‘csoundGetOutputBuffer’ was not declared in this scope
aclient.cpp: In member function ‘int TamTamSound::start(int)’:
aclient.cpp:659: error: ‘csound’ was not declared in this scope
aclient.cpp:666: error: ‘csoundCreateThread’ was not declared in this scope
aclient.cpp: In member function ‘int TamTamSound::stop()’:
aclient.cpp:673: error: ‘csound’ was not declared in this scope
aclient.cpp:681: error: ‘csoundJoinThread’ was not declared in this scope
aclient.cpp: In member function ‘void TamTamSound::scoreEvent(char, int*, int)’:
aclient.cpp:692: error: ‘csound’ was not declared in this scope
aclient.cpp:704: warning: format ‘%lf’ expects type ‘double’, but argument 3 has type ‘int’
aclient.cpp:707: error: ‘csound’ was not declared in this scope
aclient.cpp:707: error: ‘csoundScoreEvent’ was not declared in this scope
aclient.cpp: In member function ‘void TamTamSound::inputMessage(const char*)’:
aclient.cpp:711: error: ‘csound’ was not declared in this scope
aclient.cpp:721: error: ‘csound’ was not declared in this scope
aclient.cpp:721: error: ‘csoundInputMessage’ was not declared in this scope
aclient.cpp: In member function ‘bool TamTamSound::good()’:
aclient.cpp:725: error: ‘csound’ was not declared in this scope
aclient.cpp: In member function ‘void TamTamSound::setMasterVolume(int)’:
aclient.cpp:730: error: ‘csound’ was not declared in this scope
aclient.cpp:739: error: ‘MYFLT’ was not declared in this scope
aclient.cpp:739: error: ‘p’ was not declared in this scope
aclient.cpp:740: error: ‘csound’ was not declared in this scope
aclient.cpp:740: error: ‘CSOUND_CONTROL_CHANNEL’ was not declared in this scope
aclient.cpp:740: error: ‘CSOUND_INPUT_CHANNEL’ was not declared in this scope
aclient.cpp:740: error: ‘csoundGetChannelPtr’ was not declared in this scope
aclient.cpp:741: error: expected `;' before ‘vol’
aclient.cpp: In member function ‘void TamTamSound::setTrackVolume(int, int)’:
aclient.cpp:750: error: ‘csound’ was not declared in this scope
aclient.cpp:759: error: ‘MYFLT’ was not declared in this scope
aclient.cpp:759: error: ‘p’ was not declared in this scope
aclient.cpp:763: error: ‘csound’ was not declared in this scope
aclient.cpp:763: error: ‘CSOUND_CONTROL_CHANNEL’ was not declared in this scope
aclient.cpp:763: error: ‘CSOUND_INPUT_CHANNEL’ was not declared in this scope
aclient.cpp:763: error: ‘csoundGetChannelPtr’ was not declared in this scope
aclient.cpp:764: error: expected `;' before ‘vol’
aclient.cpp: In member function ‘void TamTamSound::setTrackpadX(int)’:
aclient.cpp:773: error: ‘csound’ was not declared in this scope
aclient.cpp:782: error: ‘MYFLT’ was not declared in this scope
aclient.cpp:782: error: ‘p’ was not declared in this scope
aclient.cpp:783: error: ‘csound’ was not declared in this scope
aclient.cpp:783: error: ‘CSOUND_CONTROL_CHANNEL’ was not declared in this scope
aclient.cpp:783: error: ‘CSOUND_INPUT_CHANNEL’ was not declared in this scope
aclient.cpp:783: error: ‘csoundGetChannelPtr’ was not declared in this scope
aclient.cpp:784: error: expected `;' before ‘value’
aclient.cpp: In member function ‘void TamTamSound::setTrackpadY(int)’:
aclient.cpp:793: error: ‘csound’ was not declared in this scope
aclient.cpp:802: error: ‘MYFLT’ was not declared in this scope
aclient.cpp:802: error: ‘p’ was not declared in this scope
aclient.cpp:803: error: ‘csound’ was not declared in this scope
aclient.cpp:803: error: ‘CSOUND_CONTROL_CHANNEL’ was not declared in this scope
aclient.cpp:803: error: ‘CSOUND_INPUT_CHANNEL’ was not declared in this scope
aclient.cpp:803: error: ‘csoundGetChannelPtr’ was not declared in this scope
aclient.cpp:804: error: expected `;' before ‘value’
aclient.cpp: At global scope:
aclient.cpp:832: error: expected initializer before ‘*’ token
aclient.cpp:819: warning: ‘void cleanup()’ defined but not used
make: *** [aclient.so] Error 1