rendered paste bodymake[2]: Leaving directory `/home/jkt/work/prog/KPhotoAlbum-src/devel/kexi/3rdparty'
Making all in kexiutils
make[2]: Entering directory `/home/jkt/work/prog/KPhotoAlbum-src/devel/kexi/kexiutils'
if /bin/sh ../../../libtool --silent --tag=CXX --mode=compile g++ -DHAVE_CONFIG_H -I. -I. -I../../.. -I./.. -I/usr/kde/3.5/include -I/usr/qt/3/include -I. -DQT_THREAD_SUPPORT -D_REENTRANT -Wno-long-long -Wundef -ansi -D_XOPEN_SOURCE=500 -D_BSD_SOURCE -Wcast-align -Wchar-subscripts -Wall -W -Wpointer-arith -O2 -Wformat-security -Wmissing-format-attribute -Wno-non-virtual-dtor -fno-exceptions -fno-check-new -fno-common -DQT_CLEAN_NAMESPACE -DQT_NO_STL -DQT_NO_COMPAT -DQT_NO_TRANSLATION -fexceptions -include ../../../kphotoalbum/kexi/kexi_global.h -DKEXI_NO_CURSOR_PROPERTY -DKEXI_NO_CTXT_HELP -DKEXI_NO_SUBFORM -DKEXI_DB_COMBOBOX_WIDGET -DKEXI_DEBUG_GUI -MT validator.lo -MD -MP -MF ".deps/validator.Tpo" -c -o validator.lo validator.cpp; \
then mv -f ".deps/validator.Tpo" ".deps/validator.Plo"; else rm -f ".deps/validator.Tpo"; exit 1; fi
cc1plus: ../../../kphotoalbum/kexi/kexi_global.h: No such file or directory
validator.cpp: In member function `virtual QValidator::State KexiUtils::MultiValidator::validate(QString&, int&) const':
validator.cpp:86: error: expected primary-expression before ',' token
validator.cpp:86: error: `it' was not declared in this scope
validator.cpp:86: error: `foreach' was not declared in this scope
validator.cpp:86: error: expected `;' before '{' token
validator.cpp:85: warning: unused variable 's'
validator.cpp:86: warning: unused variable 'it'
validator.cpp:86: warning: unused variable 'foreach'
validator.cpp: In member function `virtual void KexiUtils::MultiValidator::fixup(QString&) const':
validator.cpp:96: error: expected primary-expression before ',' token
validator.cpp:96: error: `it' was not declared in this scope
validator.cpp:96: error: `foreach' was not declared in this scope
validator.cpp:96: warning: unused variable 'foreach'
validator.cpp: In member function `virtual KexiUtils::Validator::Result KexiUtils::MultiValidator::internalCheck(const QString&, const QVariant&, QString&, QString&)':
validator.cpp:106: error: expected primary-expression before ',' token
validator.cpp:106: error: `it' was not declared in this scope
validator.cpp:106: error: `foreach' was not declared in this scope
validator.cpp:106: error: expected `;' before '{' token
validator.cpp:104: warning: unused variable 'r'
validator.cpp:106: warning: unused variable 'it'
validator.cpp:106: warning: unused variable 'foreach'
validator.cpp: At global scope:
validator.cpp:103: warning: unused parameter 'valueName'
validator.cpp:103: warning: unused parameter 'v'
validator.cpp:103: warning: unused parameter 'message'
validator.cpp:103: warning: unused parameter 'details'
validator.cpp:84: warning: unused parameter 'input'
validator.cpp:84: warning: unused parameter 'pos'
make[2]: *** [validator.lo] Error 1
make[2]: Leaving directory `/home/jkt/work/prog/KPhotoAlbum-src/devel/kexi/kexiutils'
make[1]: *** [all-recursive] Error 1
make[1]: Leaving directory `/home/jkt/work/prog/KPhotoAlbum-src/devel/kexi'
make: *** [all-recursive] Error 1